"uri","answering body","answer > is ministerial correction","answer > date of answer","answer > answer text","answer > answering member constituency","answer > answering member printed","answer > grouped question UIN","answer > question first answered","answer > uri","answer > answering member > label","answer > uri","answer > previous answer version > answering member constituency","answer > previous answer version > answering member printed","answer > previous answer version > uri","answer > previous answer version > answering member > label","answering dept id","answering dept short name","answering dept sort name","date","hansard heading","house id","legislature > pref label","question text","registered interest","tabling member > label","tabling member constituency","tabling member printed","uin"
"http://data.parliament.uk/resources/100646","Department for Culture Media and Sport","false","2014-10-27","<p>The Fraud Act 2006 and the Bribery Act 2010 constitute the fraud and corruption legislation that, along with the Gambling Act 2005, meet the requirements of the Council of Europe’s draft convention to combat the manipulation of sports competition.</p><p> </p>",,"Lord Gardiner of Kimble",,"2014-10-27T16:43:03.6353143Z","http://data.parliament.uk/resources/100646/answer","Biography information for Lord Gardiner of Kimble","http://data.parliament.uk/resources/100646/answer",,,,,"10","Culture, Media and Sport","Culture, Media and Sport","2014-10-23","Council of Europe Convention on the Manipulation of Sports Competitions","2","House of Lords","To ask Her Majesty’s Government, further to the Written Answer by Lord Gardiner of Kimble on 22 October (HL2135), whether they will list the fraud and corruption legislation which, in addition to the Gambling Act 2005, they believe meets the requirements of the Council of Europe’s draft convention to combat the manipulation of sports competitions.","false","Biography information for Lord Moynihan",,"Lord Moynihan","HL2377"
"http://data.parliament.uk/resources/100587","Department for Environment, Food and Rural Affairs","false","2014-10-27","<p>The Welfare of Racing Greyhounds Regulations 2010 are not due for review until after they have been in force for five years, which will be April 2015. However, Defra is beginning to gather evidence on the operation of the regulations now, with a view to completing the review by summer 2015.</p><p> </p>",,"Lord De Mauley",,"2014-10-27T17:50:36.7293091Z","http://data.parliament.uk/resources/100587/answer","Biography information for Lord De Mauley","http://data.parliament.uk/resources/100587/answer",,,,,"13","Environment, Food and Rural Affairs","Environment, Food and Rural Affairs","2014-10-22","Welfare of Racing Greyhounds Regulations 2010","2","House of Lords","To ask Her Majesty’s Government whether they will bring forward the review of the Welfare of Racing Greyhounds Regulations 2010.","false","Biography information for Lord Black of Brentwood",,"Lord Black of Brentwood","HL2324"
"http://data.parliament.uk/resources/100083","Department for Business, Innovation and Skills","false","2014-10-27","<p>The table below shows the proportion, expressed as a percentage, of small and medium-sized enterprises (SMEs) of the total number of exporters UK Export Finance (UKEF) has supported broken down by UKEF product for the last five financial full years.</p><p> </p><p> </p><p> </p><table><tbody><tr><td><p> </p></td><td><p>2009/10</p></td><td><p>2010/11</p></td><td><p>2011/12</p></td><td><p>2012/13</p></td><td><p>2013/14</p></td></tr><tr><td><p>Buyer Credit</p></td><td><p>0%</p></td><td><p>0%</p></td><td><p>0%</p></td><td><p>11%</p></td><td><p>7%</p></td></tr><tr><td><p>Bond Support Scheme*</p></td><td><p>-</p></td><td><p>-</p></td><td><p>67%</p></td><td><p>78%</p></td><td><p>91%</p></td></tr><tr><td><p>Export Insurance Policy</p></td><td><p>20%</p></td><td><p>75%</p></td><td><p>75%</p></td><td><p>54%</p></td><td><p>63%</p></td></tr><tr><td><p>Export Working Capital Scheme*</p></td><td><p>-</p></td><td><p>-</p></td><td><p>0%</p></td><td><p>83%</p></td><td><p>100%</p></td></tr><tr><td><p>Letter of Credit Guarantee Scheme</p></td><td><p>0%</p></td><td><p>0%</p></td><td><p>0%</p></td><td><p>0%</p></td><td><p>50%</p></td></tr><tr><td><p>Supplier Credit Facility</p></td><td><p>0%</p></td><td><p>50%</p></td><td><p>29%</p></td><td><p>33%</p></td><td><p>0%</p></td></tr></tbody></table><p> </p><p>*Products launched in 2011/12</p><p> </p><p> </p><p> </p><p>SMEs are defined by the EU as companies that have fewer than 250 employees, and either a turnover of less than €50m or a balance sheet total of less than €43m.</p><p> </p><p>Information on UKEFs Bond Support Scheme has been included given that it was introduced specifically to support to smaller exporters, especially SMEs.</p><p> </p>","West Suffolk","Matthew Hancock","211332 ; 211333 ; 211334 ; 211335","2014-10-27T14:39:53.8322655Z","http://data.parliament.uk/resources/100083/answer","Biography information for Matt Hancock","http://data.parliament.uk/resources/100083/answer","West Suffolk","Matthew Hancock","http://data.parliament.uk/resources/100083/answer/previousversion/24212","Biography information for Matt Hancock","26","Business, Innovation and Skills","Business, Innovation and Skills","2014-10-21","UK Export Finance","1","House of Commons","To ask the Secretary of State for Business, Innovation and Skills, what proportion of successful applicants to the UK Export Finance export insurance scheme have been small to medium sized enterprises in each of the last five years.","false","Biography information for Ann McKechin","Glasgow North","Ann McKechin","211331"
"http://data.parliament.uk/resources/100084","Department for Business, Innovation and Skills","false","2014-10-27","<p>The table below shows the proportion, expressed as a percentage, of small and medium-sized enterprises (SMEs) of the total number of exporters UK Export Finance (UKEF) has supported broken down by UKEF product for the last five financial full years.</p><p> </p><p> </p><p> </p><table><tbody><tr><td><p> </p></td><td><p>2009/10</p></td><td><p>2010/11</p></td><td><p>2011/12</p></td><td><p>2012/13</p></td><td><p>2013/14</p></td></tr><tr><td><p>Buyer Credit</p></td><td><p>0%</p></td><td><p>0%</p></td><td><p>0%</p></td><td><p>11%</p></td><td><p>7%</p></td></tr><tr><td><p>Bond Support Scheme*</p></td><td><p>-</p></td><td><p>-</p></td><td><p>67%</p></td><td><p>78%</p></td><td><p>91%</p></td></tr><tr><td><p>Export Insurance Policy</p></td><td><p>20%</p></td><td><p>75%</p></td><td><p>75%</p></td><td><p>54%</p></td><td><p>63%</p></td></tr><tr><td><p>Export Working Capital Scheme*</p></td><td><p>-</p></td><td><p>-</p></td><td><p>0%</p></td><td><p>83%</p></td><td><p>100%</p></td></tr><tr><td><p>Letter of Credit Guarantee Scheme</p></td><td><p>0%</p></td><td><p>0%</p></td><td><p>0%</p></td><td><p>0%</p></td><td><p>50%</p></td></tr><tr><td><p>Supplier Credit Facility</p></td><td><p>0%</p></td><td><p>50%</p></td><td><p>29%</p></td><td><p>33%</p></td><td><p>0%</p></td></tr></tbody></table><p> </p><p>*Products launched in 2011/12</p><p> </p><p> </p><p> </p><p>SMEs are defined by the EU as companies that have fewer than 250 employees, and either a turnover of less than €50m or a balance sheet total of less than €43m.</p><p> </p><p>Information on UKEFs Bond Support Scheme has been included given that it was introduced specifically to support to smaller exporters, especially SMEs.</p><p> </p>","West Suffolk","Matthew Hancock","211331 ; 211333 ; 211334 ; 211335","2014-10-27T14:39:53.7228353Z","http://data.parliament.uk/resources/100084/answer","Biography information for Matt Hancock","http://data.parliament.uk/resources/100084/answer","West Suffolk","Matthew Hancock","http://data.parliament.uk/resources/100084/answer/previousversion/24211","Biography information for Matt Hancock","26","Business, Innovation and Skills","Business, Innovation and Skills","2014-10-21","UK Export Finance","1","House of Commons","To ask the Secretary of State for Business, Innovation and Skills, what proportion of successful applicants to the UK Export Finance export working capital scheme have been small to medium sized enterprises in each of the last five years.","false","Biography information for Ann McKechin","Glasgow North","Ann McKechin","211332"
"http://data.parliament.uk/resources/100085","Department for Business, Innovation and Skills","false","2014-10-27","<p>The table below shows the proportion, expressed as a percentage, of small and medium-sized enterprises (SMEs) of the total number of exporters UK Export Finance (UKEF) has supported broken down by UKEF product for the last five financial full years.</p><p> </p><p> </p><p> </p><table><tbody><tr><td><p> </p></td><td><p>2009/10</p></td><td><p>2010/11</p></td><td><p>2011/12</p></td><td><p>2012/13</p></td><td><p>2013/14</p></td></tr><tr><td><p>Buyer Credit</p></td><td><p>0%</p></td><td><p>0%</p></td><td><p>0%</p></td><td><p>11%</p></td><td><p>7%</p></td></tr><tr><td><p>Bond Support Scheme*</p></td><td><p>-</p></td><td><p>-</p></td><td><p>67%</p></td><td><p>78%</p></td><td><p>91%</p></td></tr><tr><td><p>Export Insurance Policy</p></td><td><p>20%</p></td><td><p>75%</p></td><td><p>75%</p></td><td><p>54%</p></td><td><p>63%</p></td></tr><tr><td><p>Export Working Capital Scheme*</p></td><td><p>-</p></td><td><p>-</p></td><td><p>0%</p></td><td><p>83%</p></td><td><p>100%</p></td></tr><tr><td><p>Letter of Credit Guarantee Scheme</p></td><td><p>0%</p></td><td><p>0%</p></td><td><p>0%</p></td><td><p>0%</p></td><td><p>50%</p></td></tr><tr><td><p>Supplier Credit Facility</p></td><td><p>0%</p></td><td><p>50%</p></td><td><p>29%</p></td><td><p>33%</p></td><td><p>0%</p></td></tr></tbody></table><p> </p><p>*Products launched in 2011/12</p><p> </p><p> </p><p> </p><p>SMEs are defined by the EU as companies that have fewer than 250 employees, and either a turnover of less than €50m or a balance sheet total of less than €43m.</p><p> </p><p>Information on UKEFs Bond Support Scheme has been included given that it was introduced specifically to support to smaller exporters, especially SMEs.</p><p> </p>","West Suffolk","Matthew Hancock","211331 ; 211332 ; 211334 ; 211335","2014-10-27T14:39:53.9416382Z","http://data.parliament.uk/resources/100085/answer","Biography information for Matt Hancock","http://data.parliament.uk/resources/100085/answer","West Suffolk","Matthew Hancock","http://data.parliament.uk/resources/100085/answer/previousversion/24213","Biography information for Matt Hancock","26","Business, Innovation and Skills","Business, Innovation and Skills","2014-10-21","UK Export Finance","1","House of Commons","To ask the Secretary of State for Business, Innovation and Skills, what proportion of successful applicants to the UK Export Finance supplier credit facility have been small to medium sized enterprises in each of the last five years.","false","Biography information for Ann McKechin","Glasgow North","Ann McKechin","211333"
"http://data.parliament.uk/resources/100086","Department for Business, Innovation and Skills","false","2014-10-27","<p>The table below shows the proportion, expressed as a percentage, of small and medium-sized enterprises (SMEs) of the total number of exporters UK Export Finance (UKEF) has supported broken down by UKEF product for the last five financial full years.</p><p> </p><p> </p><p> </p><table><tbody><tr><td><p> </p></td><td><p>2009/10</p></td><td><p>2010/11</p></td><td><p>2011/12</p></td><td><p>2012/13</p></td><td><p>2013/14</p></td></tr><tr><td><p>Buyer Credit</p></td><td><p>0%</p></td><td><p>0%</p></td><td><p>0%</p></td><td><p>11%</p></td><td><p>7%</p></td></tr><tr><td><p>Bond Support Scheme*</p></td><td><p>-</p></td><td><p>-</p></td><td><p>67%</p></td><td><p>78%</p></td><td><p>91%</p></td></tr><tr><td><p>Export Insurance Policy</p></td><td><p>20%</p></td><td><p>75%</p></td><td><p>75%</p></td><td><p>54%</p></td><td><p>63%</p></td></tr><tr><td><p>Export Working Capital Scheme*</p></td><td><p>-</p></td><td><p>-</p></td><td><p>0%</p></td><td><p>83%</p></td><td><p>100%</p></td></tr><tr><td><p>Letter of Credit Guarantee Scheme</p></td><td><p>0%</p></td><td><p>0%</p></td><td><p>0%</p></td><td><p>0%</p></td><td><p>50%</p></td></tr><tr><td><p>Supplier Credit Facility</p></td><td><p>0%</p></td><td><p>50%</p></td><td><p>29%</p></td><td><p>33%</p></td><td><p>0%</p></td></tr></tbody></table><p> </p><p>*Products launched in 2011/12</p><p> </p><p> </p><p> </p><p>SMEs are defined by the EU as companies that have fewer than 250 employees, and either a turnover of less than €50m or a balance sheet total of less than €43m.</p><p> </p><p>Information on UKEFs Bond Support Scheme has been included given that it was introduced specifically to support to smaller exporters, especially SMEs.</p><p> </p>","West Suffolk","Matthew Hancock","211331 ; 211332 ; 211333 ; 211335","2014-10-27T14:39:54.1603405Z","http://data.parliament.uk/resources/100086/answer","Biography information for Matt Hancock","http://data.parliament.uk/resources/100086/answer","West Suffolk","Matthew Hancock","http://data.parliament.uk/resources/100086/answer/previousversion/24215","Biography information for Matt Hancock","26","Business, Innovation and Skills","Business, Innovation and Skills","2014-10-21","UK Export Finance","1","House of Commons","To ask the Secretary of State for Business, Innovation and Skills, what proportion of successful applicants to the UK Export Finance letter of credit guarantee scheme have been small to medium sized enterprises in each of the last five years.","false","Biography information for Ann McKechin","Glasgow North","Ann McKechin","211334"
"http://data.parliament.uk/resources/100087","Department for Business, Innovation and Skills","false","2014-10-27","<p>The table below shows the proportion, expressed as a percentage, of small and medium-sized enterprises (SMEs) of the total number of exporters UK Export Finance (UKEF) has supported broken down by UKEF product for the last five financial full years.</p><p> </p><p> </p><p> </p><table><tbody><tr><td><p> </p></td><td><p>2009/10</p></td><td><p>2010/11</p></td><td><p>2011/12</p></td><td><p>2012/13</p></td><td><p>2013/14</p></td></tr><tr><td><p>Buyer Credit</p></td><td><p>0%</p></td><td><p>0%</p></td><td><p>0%</p></td><td><p>11%</p></td><td><p>7%</p></td></tr><tr><td><p>Bond Support Scheme*</p></td><td><p>-</p></td><td><p>-</p></td><td><p>67%</p></td><td><p>78%</p></td><td><p>91%</p></td></tr><tr><td><p>Export Insurance Policy</p></td><td><p>20%</p></td><td><p>75%</p></td><td><p>75%</p></td><td><p>54%</p></td><td><p>63%</p></td></tr><tr><td><p>Export Working Capital Scheme*</p></td><td><p>-</p></td><td><p>-</p></td><td><p>0%</p></td><td><p>83%</p></td><td><p>100%</p></td></tr><tr><td><p>Letter of Credit Guarantee Scheme</p></td><td><p>0%</p></td><td><p>0%</p></td><td><p>0%</p></td><td><p>0%</p></td><td><p>50%</p></td></tr><tr><td><p>Supplier Credit Facility</p></td><td><p>0%</p></td><td><p>50%</p></td><td><p>29%</p></td><td><p>33%</p></td><td><p>0%</p></td></tr></tbody></table><p> </p><p>*Products launched in 2011/12</p><p> </p><p> </p><p> </p><p>SMEs are defined by the EU as companies that have fewer than 250 employees, and either a turnover of less than €50m or a balance sheet total of less than €43m.</p><p> </p><p>Information on UKEFs Bond Support Scheme has been included given that it was introduced specifically to support to smaller exporters, especially SMEs.</p><p> </p>","West Suffolk","Matthew Hancock","211331 ; 211332 ; 211333 ; 211334","2014-10-27T14:39:54.2643452Z","http://data.parliament.uk/resources/100087/answer","Biography information for Matt Hancock","http://data.parliament.uk/resources/100087/answer","West Suffolk","Matthew Hancock","http://data.parliament.uk/resources/100087/answer/previousversion/24216","Biography information for Matt Hancock","26","Business, Innovation and Skills","Business, Innovation and Skills","2014-10-21","UK Export Finance","1","House of Commons","To ask the Secretary of State for Business, Innovation and Skills, what proportion of successful applicants to the UK Export Finance buyer credit facility of credit guarantee scheme have been small to medium sized enterprises in each of the last five years.","false","Biography information for Ann McKechin","Glasgow North","Ann McKechin","211335"
"http://data.parliament.uk/resources/100088","Department for Business, Innovation and Skills","false","2014-10-24","<p>Early Conciliation was introduced in April 2014 and it is too early to make any meaningful assessment on the effect of Early Conciliation on Employment Tribunal cases at this stage. However, officials in the Department and Acas are already monitoring the impact of Early Conciliation and I will make an announcement on evaluation in due course, once we have a sufficient evidence base to do so.</p>","East Dunbartonshire","Jo Swinson",,"2014-10-24T11:30:02.3392087Z","http://data.parliament.uk/resources/100088/answer","Biography information for Jo Swinson","http://data.parliament.uk/resources/100088/answer",,,,,"26","Business, Innovation and Skills","Business, Innovation and Skills","2014-10-21","ACAS","1","House of Commons","To ask the Secretary of State for Business, Innovation and Skills, when he plans to evaluate the effect of the ACAS early conciliation service on keeping workplace disputes out of court.","false","Biography information for Sir Stephen Timms","East Ham","Stephen Timms","211244"
"http://data.parliament.uk/resources/100102","Department for Business, Innovation and Skills","false","2014-10-24","<p>Innovate UK is the new name for the Technology Strategy Board.</p><p> </p><p> </p><p> </p><p>In 2011/12 Innovate UK did not provide any funds to organisations in the video games sector. In 2012/13, it provided £277k (0.06% of its core budget) to organisations in the video games sector and in 2013/14 it provided £1.9m (0.4% of its core budget).</p><p> </p><p> </p><p> </p><p>The figures above do not include any awards made under Innovate UK’s Smart or Knowledge Transfer Partnership programmes, as this information can only be provided at disproportionate cost.</p><p> </p><p> </p><p> </p>","Wantage","Mr Edward Vaizey",,"2014-10-24T06:55:43.7900866Z","http://data.parliament.uk/resources/100102/answer","Biography information for Lord Vaizey of Didcot","http://data.parliament.uk/resources/100102/answer",,,,,"26","Business, Innovation and Skills","Business, Innovation and Skills","2014-10-21","Video Games","1","House of Commons","To ask the Secretary of State for Business, Innovation and Skills, what funds distributed by the Technology Strategy Board were allocated to the video games sector in each of the last three years; and what proportion of the total funding from that Board this represented in each such year.","false","Biography information for Luciana Berger","Liverpool, Wavertree","Luciana Berger","211397"
"http://data.parliament.uk/resources/100103","Department for Business, Innovation and Skills","false","2014-10-24","<p>£7.5m was spent by HM Revenue and Customs on the enforcement of the National Minimum Wage in 2013/14.</p><p>We have increased the budget allocation for National Minimum Wage enforcement in 2014/15 to £9.2m. This extra funding will enable HMRC to increase the number of compliance officers working in this area who, as well as continuing to respond to every complaint made to the Pay and Work Rights Helpline, will also undertake targeted enforcement, focusing on the worst offending employers in the highest-risk sectors.</p><p>Anyone who believes they are entitled to the National Minimum Wage and has not received it should contact this free and confidential helpline on 0800 917 2368.</p>","East Dunbartonshire","Jo Swinson",,"2014-10-24T11:29:09.5418464Z","http://data.parliament.uk/resources/100103/answer","Biography information for Jo Swinson","http://data.parliament.uk/resources/100103/answer",,,,,"26","Business, Innovation and Skills","Business, Innovation and Skills","2014-10-21","Minimum Wage","1","House of Commons","To ask the Secretary of State for Business, Innovation and Skills, pursuant to the Answer of 25 June 2014 to Question 201383, how much was spent on national minimum wage enforcement in 2013-14.","false","Biography information for Sir Stephen Timms","East Ham","Stephen Timms","211245"
