"uri","answering body","answer > is ministerial correction","answer > date of answer","answer > answer text","answer > answering member constituency","answer > answering member printed","answer > grouped question UIN","answer > question first answered","answer > uri","answer > answering member > label","answer > uri","answer > attachment > file name","answer > attachment > title","answering dept id","answering dept short name","answering dept sort name","date","hansard heading","house id","legislature > pref label","question text","registered interest","tabling member > label","tabling member constituency","tabling member printed","uin"
"http://data.parliament.uk/resources/1007689","Department for Work and Pensions","false","2018-11-15","<p>Universal Credit treats all individuals equally, irrespective of gender. It provides one-to-one support and incentives to help claimants to progress in work.</p><p> </p><p>The latest Office for National Statistics labour market statistics show a near record high rate for women in employment.</p>","Reading West","Alok Sharma",,"2018-11-15T15:28:41.083Z","http://data.parliament.uk/resources/1007689/answer","Biography information for Sir Alok Sharma","http://data.parliament.uk/resources/1007689/answer",,,"29","Work and Pensions","Work and Pensions","2018-11-15","Universal Credit: Females","1","House of Commons","To ask the Secretary of State for Work and Pensions, what recent assessment the Government has made of the effect of the roll-out of universal credit on women.","false","Biography information for Mrs Sharon Hodgson","Washington and Sunderland West","Mrs Sharon Hodgson","907643"
"http://data.parliament.uk/resources/1006000","Department for Education","false","2018-11-21","<p>The department has had no discussions with Lancashire County Council with regards to their ban on halal and kosher meat in school meals. The government sets out required minimum standards for school food in the School Food Standards to ensure that children are served healthy, nutritious meals at school. The standards do not specify food requirements in terms of cultural and religious needs.</p><p>Headteachers, governors and their caterers are best placed to make decisions about their school food policies, which includes acting reasonably to provide choices that take account of cultural, religious and special dietary needs. Schools that choose to arrange their school meals through a local authority or another catering organisation may wish to take this into consideration. Schools may consider providing both halal and non-halal or kosher food each day, or ensuring that dishes are clearly labelled to allow pupils to select the appropriate choice.</p>","Stratford-on-Avon","Nadhim Zahawi",,"2018-11-21T09:49:14.42Z","http://data.parliament.uk/resources/1006000/answer","Biography information for Nadhim Zahawi","http://data.parliament.uk/resources/1006000/answer",,,"60","Education","Education","2018-11-13","School Meals: Lancashire","1","House of Commons","To ask the Secretary of State for Education, what discussions his Department has had with Lancashire County Council on the Council's ban on halal and kosher meat in school meals.","false","Biography information for John Spellar","Warley","John Spellar","190757"
"http://data.parliament.uk/resources/1003664","Department for Business, Energy and Industrial Strategy","false","2018-11-14","<p>No such assessment has been made to date. This is because rights holders tend to use collective management organisation (CMOs) to collect and distribute royalties earned in other EU countries. UK and EU CMOs enter into reciprocal agreements with each other to do this. These are private commercial agreements between the parties which we would expect to continue after the UK has exited the Digital Single Market.</p>","East Surrey","Mr Sam Gyimah",,"2018-11-14T18:00:14.177Z","http://data.parliament.uk/resources/1003664/answer","Biography information for Mr Sam Gyimah","http://data.parliament.uk/resources/1003664/answer",,,"201","Business, Energy and Industrial Strategy","Business, Energy and Industrial Strategy","2018-11-09","Musicians: British Nationals Abroad","1","House of Commons","To ask the Secretary of State for Digital, Culture, Media and Sport, what assessment he has made of the effect of leaving the Digital Single Market on the royalties earned in EU countries by UK musicians.","false","Biography information for James Frith","Bury North","James Frith","189800"
"http://data.parliament.uk/resources/1003696","Department for Digital, Culture, Media and Sport","false","2018-11-19","<p>The government has outlined our aspiration to negotiate an agreement with the European Union on our future economic partnership that will include a UK-EU free trade area for goods, and a comprehensive package for services. We will also seek to negotiate a mobility framework with the EU that supports businesses to provide services, and allows people to travel freely without a visa for tourism and temporary business activity. Subject to the negotiations, we expect these measures to minimise barriers to UK businesses, including sports organisations such as British Rowing, in trading and working with their counterparts in the EU after we leave.</p>","Eastleigh","Mims Davies",,"2018-11-19T17:15:42.257Z","http://data.parliament.uk/resources/1003696/answer","Biography information for Mims Davies","http://data.parliament.uk/resources/1003696/answer",,,"10","Digital, Culture, Media and Sport","Digital, Culture, Media and Sport","2018-11-09","British Rowing","1","House of Commons","To ask the Secretary of State for Digital, Culture, Media and Sport, whether his Department has made an assessment of the Rowing Association's ability to trade and work with its counterpart clubs in EU member states after the UK leaves the EU.","false","Biography information for Royston Smith","Southampton, Itchen","Royston Smith","189747"
"http://data.parliament.uk/resources/1003698","Department for Digital, Culture, Media and Sport","false","2018-11-14","<p>The Cyber Essentials scheme is largely self sustaining. The small cost to Government is mostly made up from proportions of time from members of staff within the National Cyber Security Centre and the Department for Digital, Culture, Media and Sport. This includes governance, technical oversight, policy development and contract management.</p><p> </p><p>The original start-up costs included an injection of investment from the Government's National Cyber Security Programme in 2014 of £766,000, but this does not include the staffing costs from the three departments which originally developed the scheme: GCHQ, the Department for Business, Innovation and Skills, and the Cabinet Office.</p><p> </p><p>The financial model for delivery of the Cyber Essentials scheme involves Government overseeing the governance, technical oversight, policy development and contract management of five industry Accreditation Bodies. The Accreditation Bodies are responsible for marketing the scheme along with their Certification Bodies and providing the certificates to those wishing to achieve certification. The Accreditation Bodies and Certification Bodies charge a fee for the issuing of certificates and any related services provided.</p>","Stourbridge","Margot James",,"2018-11-14T17:57:44.327Z","http://data.parliament.uk/resources/1003698/answer","Biography information for Margot James","http://data.parliament.uk/resources/1003698/answer",,,"10","Digital, Culture, Media and Sport","Digital, Culture, Media and Sport","2018-11-09","Government Departments: Cybersecurity","1","House of Commons","To ask the Secretary of State for Digital, Culture, Media and Sport, what the total cost of the Cyber Essentials scheme has been to date.","false","Biography information for Jo Platt","Leigh","Jo Platt","189801"
"http://data.parliament.uk/resources/1003737","Cabinet Office","false","2018-11-19","<p>The information requested falls within the responsibility of the UK Statistics Authority. I have asked the Authority to reply.</p>","Norwich North","Chloe Smith",,"2018-11-19T16:52:46.363Z","http://data.parliament.uk/resources/1003737/answer","Biography information for Chloe Smith","http://data.parliament.uk/resources/1003737/answer","PQ 189811 189812 189813_final.pdf","UKSA response ","53","Cabinet Office","Cabinet Office","2018-11-09","Employment: Hearing Impairment","1","House of Commons","To ask the Minister for the Cabinet Office, what estimate his Department has made of the proportion of people whose primary medical condition is difficulty in hearing in the age range (a) 16 to 18, (b) 18 to 24, (c) 25 to 34, (d) 35 to 49, (e) 50 to 64 who have been in employment for each of the last five years for which figures available.","false","Biography information for Liz Twist","Blaydon","Liz Twist","189811"
"http://data.parliament.uk/resources/1003738","Cabinet Office","false","2018-11-19","<p>The information requested falls within the responsibility of the UK Statistics Authority. I have asked the Authority to reply.</p>","Norwich North","Chloe Smith","189811 ; 189813","2018-11-19T16:52:46.41Z","http://data.parliament.uk/resources/1003738/answer","Biography information for Chloe Smith","http://data.parliament.uk/resources/1003738/answer",,,"53","Cabinet Office","Cabinet Office","2018-11-09","Employment: Hearing Impairment","1","House of Commons","To ask the Minister for the Cabinet Office, what estimate his Department has made of the proportion of graduates whose primary medical condition is difficulty in hearing that are (a) in employment, (b) unemployed and (c) economically inactive.","false","Biography information for Liz Twist","Blaydon","Liz Twist","189812"
"http://data.parliament.uk/resources/1003739","Cabinet Office","false","2018-11-19","<p>The information requested falls within the responsibility of the UK Statistics Authority. I have asked the Authority to reply.</p>","Norwich North","Chloe Smith","189811 ; 189812","2018-11-19T16:52:46.457Z","http://data.parliament.uk/resources/1003739/answer","Biography information for Chloe Smith","http://data.parliament.uk/resources/1003739/answer",,,"53","Cabinet Office","Cabinet Office","2018-11-09","Employment: Hearing Impairment","1","House of Commons","To ask the Minister for the Cabinet Office, what estimate her Department has made of the proportion of people whose primary medical condition is difficulty in hearing that work in the (a) public, (b) private and (c) voluntary sector.","false","Biography information for Liz Twist","Blaydon","Liz Twist","189813"
"http://data.parliament.uk/resources/1002604","Department for Transport","false","2018-11-12","<p>The Driver and Vehicle Licensing Agency (DVLA) neither promotes the release of personal data, nor does the DVLA seek to release personal data to generate a fee/revenue.</p><p> </p><p>DVLA responds, as required, to each request for vehicle and driver data and while DVLA is permitted to charge a fee for the release of information under the reasonable cause provisions, DVLA is not permitted to profit from the release. The fee set is to recover the related administrative costs and this means that it is the applicant and not the taxpayer that funds this activity.</p><p> </p><p>Total fees recognised by DVLA from charges for requests for vehicle and driver personal data for the most recent financial year available, is:</p><p> </p><table><tbody><tr><td><p> </p></td><td><p>2017-18</p></td></tr><tr><td><p>Account</p></td><td><p>£000s</p></td></tr><tr><td><p>Driver Fee Paying Enquiries</p></td><td><p>4,597</p></td></tr><tr><td><p>Vehicle Fee Paying Enquiries</p></td><td><p>350</p></td></tr><tr><td><p>Electronic Data Link Fee Paying Enquiries</p></td><td><p>15,951</p></td></tr><tr><td><p>Receipts / Sale Vehicles including Bulk Data</p></td><td><p>1,920</p></td></tr><tr><td><p><strong>Total</strong></p></td><td><p><strong>22,818</strong></p></td></tr></tbody></table><p> </p><p> </p>","Hereford and South Herefordshire","Jesse Norman",,"2018-11-12T17:59:22.733Z","http://data.parliament.uk/resources/1002604/answer","Biography information for Jesse Norman","http://data.parliament.uk/resources/1002604/answer",,,"27","Transport","Transport","2018-11-06","Driver and Vehicle Licensing Agency","1","House of Commons","To ask the Secretary of State for Transport, how much revenue the Driver and Vehicle Licensing Agency raised from selling personal data to third parties in the last financial year.","false","Biography information for Martyn Day","Linlithgow and East Falkirk","Martyn Day","188880"
"http://data.parliament.uk/resources/1002678","Home Office","false","2018-11-12","<p>The prescription of these products by doctors on the Specialist Register of the General Medical Council (GMC) and only where there is an unmet clinical need follows the principles used by the Interim Expert Panel on cannabis-based products for medicinal use. This approach was agreed by senior clinicians on the Expert Panel, Chaired by Dr Michael McBride, Chief Medical Officer for Northern Ireland. This approach was subsequently supported by the Advisory Council on the Misuse of Drugs (ACMD) in their advice to the Home Secretary on rescheduling cannabis. The ACMD advice has been published and is available at the following link:</p><p><a href="https://www.gov.uk/government/publications/further-advice-on-scheduling-of-cannabis-derived-medicinal-products" target="_blank">https://www.gov.uk/government/publications/further-advice-on-scheduling-of-cannabis-derived-medicinal-products</a></p><p>Any unlicensed medicines, including cannabis-based products for medicinal use, will be supplied under long-standing arrangements for the supply of what are known, in healthcare settings, as ‘specials’. This process is underpinned by the Human Medicines Act and, outside of clinical trials, only allows these unlicensed medicines to be prescribed where there is an unmet clinical need. This restriction is in place because unlicensed medicines have not been through the same quality, safety and efficacy tests as licenced medicines.</p>","Ruislip, Northwood and Pinner","Mr Nick Hurd",,"2018-11-12T17:05:51.537Z","http://data.parliament.uk/resources/1002678/answer","Biography information for Mr Nick Hurd","http://data.parliament.uk/resources/1002678/answer",,,"1","Home Office","Home Office","2018-11-06","Cannabis: Medical Treatments","1","House of Commons","To ask the Secretary of State for the Home Department, if he will publish the advice used to inform his Department on the requirements that (a) the decision to prescribe medicinal cannabis products must be made by a specialist doctor and (b) medicinal cannabis products may only be prescribed when the patient has an unmet special clinical need that cannot be met by other treatments.","false","Biography information for Norman Lamb","North Norfolk","Norman Lamb","188750"
