"uri","answering body","answer > is ministerial correction","answer > date of answer","answer > answer text","answer > answering member constituency","answer > answering member printed","answer > grouped question UIN","answer > question first answered","answer > uri","answer > answering member > label","answer > uri","answer > attachment > file name","answer > attachment > title","answering dept id","answering dept short name","answering dept sort name","date","hansard heading","house id","legislature > pref label","question text","registered interest","tabling member > label","tabling member constituency","tabling member printed","uin"
"http://data.parliament.uk/resources/1148218","Treasury","false","2019-10-08","<p>Official statistics published by the Valuation Office Agency (VOA) on 22 August show that the system is operating as intended with issues being resolved at the appropriate stage. At 30 June 2019, 100,740 Checks and 17,010 Challenges had been registered, of which 89,440 Checks and 6,300 Challenges had been resolved. Most Checks are currently being resolved in 3 months and most Challenges within 12 months.</p><p> </p><p>The Ministry of Housing, Communities and Local Government intends to carry out a review of the effectiveness of the Check, Challenge, Appeal system. The VOA is also conducting a customer evaluation of the delivery of the new system.</p>","Hereford and South Herefordshire","Jesse Norman",,"2019-10-08T12:10:39.487Z","http://data.parliament.uk/resources/1148218/answer","Biography information for Jesse Norman","http://data.parliament.uk/resources/1148218/answer",,,"14","Treasury","Treasury","2019-10-03","Non-domestic Rates: Appeals","1","House of Commons","To ask the Chancellor of the Exchequer, what recent assessment he has made of the effectiveness of the business rates appeal system Check, Challenge, Appeal.","false","Biography information for Steve Double","St Austell and Newquay","Steve Double","294199"
"http://data.parliament.uk/resources/1141931","Ministry of Housing, Communities and Local Government","false","2019-08-07","<p>The Government will communicate the outcomes of its review into the Check Challenge Appeal reforms in due course. We expect that the review will draw upon the formal evaluation of the new system which is being led by the Valuation Office Agency and which is currently underway. This evaluation includes engagement with ratepayers and their representatives. MHCLG and the Valuation Office Agency also work closely together to engage with ratepayers and their representatives on the new appeals system and other issues on an ongoing basis.</p>",,"Viscount Younger of Leckie",,"2019-08-07T13:30:02.95Z","http://data.parliament.uk/resources/1141931/answer","Biography information for Viscount Younger of Leckie","http://data.parliament.uk/resources/1141931/answer",,,"7","Housing, Communities and Local Government","Housing, Communities and Local Government","2019-07-24","Non-domestic Rates: Appeals","2","House of Lords","To ask Her Majesty's Government what progress they have made in the review of the implementation of the package of reforms they undertook to carry out by 2019 in their response to Check, challenge, appeal: Reforming business rates appeals—consultation on statutory implementation, published in March 2017; and what formal procedures are being put in place to ensure that ratepayers and their representatives have an opportunity to submit representations to that review.","false","Biography information for The Earl of Lytton",,"The Earl of Lytton","HL17475"
"http://data.parliament.uk/resources/1012137","Ministry of Housing, Communities and Local Government","false","2018-12-03","<p>It is a requirement on the Valuation Office Agency (VOA) under Regulation 22(1A) of the Non-Domestic Rating (Alteration of Lists and Appeals) (England) Regulations 2009 (as amended) that, at the same time certain notices relating to the progression of a case or imposition of a penalty are sent to a ratepayer’s agent they must also be provided to the ratepayer. The VOA has procedures to ensure that notices are sent to an interested party and their agent at the same time.</p>",,"Lord Bourne of Aberystwyth",,"2018-12-03T16:40:18.55Z","http://data.parliament.uk/resources/1012137/answer","Biography information for Lord Bourne of Aberystwyth","http://data.parliament.uk/resources/1012137/answer",,,"7","Housing, Communities and Local Government","Housing, Communities and Local Government","2018-11-21","Non-domestic Rates: Appeals","2","House of Lords","To ask Her Majesty's Government whether in the context of check-challenge-appeal it is a requirement under Regulation 22(1A) of the Non-Domestic Rating (Alteration of Lists and Appeals) (England) Regulations 2009 (as amended) for the Valuation Office Agency in issuing notifications or certificates to communicate with both the ratepayer and the ratepayer's registered agent simultaneously; and if not, what is the procedure for making sure that both ratepayer and agent receive timely and accurate information necessary to progress through the process.","false","Biography information for The Earl of Lytton",,"The Earl of Lytton","HL11664"
"http://data.parliament.uk/resources/983154","Treasury","false","2018-10-16","<p>The Government introduced the new business rate appeal system Check, Challenge, Appeal (CCA) in April 2017. Under the old system, many appeals were submitted with little or no evidence, causing delay, and the lack of evidence meant the VOA couldn’t separate genuine appeals from speculative ones.</p><p>Under CCA, ratepayers can check the facts held about their property and view their valuation before deciding whether to challenge it. If they go on to challenge they must provide the full evidence for their challenge, giving the VOA the opportunity to address and resolve the issues. This minimises uncertainty, ensuring businesses reach a resolution quicker, without the automatic need for an appeal to the independent Valuation Tribunal.</p><p>Official VOA statistics released on 16 August 2018 show that as of 30 June 2018, most checks are being resolved within three months and most challenges within six months.</p>","Central Devon","Mel Stride",,"2018-10-16T16:52:20.92Z","http://data.parliament.uk/resources/983154/answer","Biography information for Mel Stride","http://data.parliament.uk/resources/983154/answer",,,"14","Treasury","Treasury","2018-10-08","Non-domestic Rates: Appeals","1","House of Commons","To ask the Chancellor of the Exchequer, what steps his Department (a) has taken and (b) plans to take to improve the time it takes the Valuation Office Agency to process appeals against business rate decisions.","false","Biography information for Caroline Lucas","Brighton, Pavilion","Caroline Lucas","176217"
"http://data.parliament.uk/resources/756788","HM Treasury","false","2017-09-07","<p>I refer the honourable member to the answer provided at UIN HC4957 for information about the effectiveness and use of the new business rates appeals system, Check, Challenge, and Appeal.</p><p> </p><p> </p>","Central Devon","Mel Stride","8323","2017-09-07T14:11:59.073Z","http://data.parliament.uk/resources/756788/answer","Biography information for Mel Stride","http://data.parliament.uk/resources/756788/answer",,,"14","Treasury","CaTreasury","2017-09-04","Non-domestic Rates: Appeals","1","House of Commons","To ask Mr Chancellor of the Exchequer, what assessment his Department has made of the effectiveness of the new business rates appeal process known as check, challenge, appeal; and if he will make a statement.","false","Biography information for Bill Esterson","Sefton Central","Bill Esterson","8321"
"http://data.parliament.uk/resources/756789","HM Treasury","false","2017-09-07","<p>The number of proposals against the 2010 Rating List received by Valuation Office Agency in each financial year from 2010-11 to 2016-17 are shown in the attached table.</p><p>These numbers are consistent with the Official Statistics on Non Domestic Rating Challenges and Changes released by the Valuation Office Agency on 24 August 2017.</p>","Central Devon","Mel Stride",,"2017-09-07T14:30:34.117Z","http://data.parliament.uk/resources/756789/answer","Biography information for Mel Stride","http://data.parliament.uk/resources/756789/answer","Annex - NDR_CC LRW1_yearly_figures_as_at_3006217_v3 (002).docx","2010 Local Rating List ","14","Treasury","CaTreasury","2017-09-04","Non-domestic Rates: Appeals","1","House of Commons","To ask Mr Chancellor of the Exchequer, how many businesses appealed their business rates in each of the last seven years in (a) England, (b) each English region and (c) each local authority area.","false","Biography information for Bill Esterson","Sefton Central","Bill Esterson","8322"
"http://data.parliament.uk/resources/756790","HM Treasury","false","2017-09-07","<p>I refer the honourable member to the answer provided at UIN HC4957 for information about the effectiveness and use of the new business rates appeals system, Check, Challenge, and Appeal.</p><p> </p><p> </p>","Central Devon","Mel Stride","8321","2017-09-07T14:11:59.137Z","http://data.parliament.uk/resources/756790/answer","Biography information for Mel Stride","http://data.parliament.uk/resources/756790/answer",,,"14","Treasury","CaTreasury","2017-09-04","Non-domestic Rates: Appeals","1","House of Commons","To ask Mr Chancellor of the Exchequer, how many businesses have registered to use the new business rates appeal process since the check, challenge, appeal system was established in (a) England, (b) each English region and (c) each local authority area.","false","Biography information for Bill Esterson","Sefton Central","Bill Esterson","8323"
"http://data.parliament.uk/resources/753982","HM Treasury","false","2017-09-05","<p>Data on outstanding challenges against the 2010 rating lists in England and Wales, and the 2017 rating lists in Wales, is publicly available at:</p><p>https://www.gov.uk/government/statistics/non-domestic-rating-challenges-and-changes-england-and-wales-june-2017-non-check-challenge-and-appeal-cca</p>","Central Devon","Mel Stride",,"2017-09-05T07:54:29.903Z","http://data.parliament.uk/resources/753982/answer","Biography information for Mel Stride","http://data.parliament.uk/resources/753982/answer",,,"14","Treasury","CaTreasury","2017-07-19","Non-domestic Rates: Appeals","1","House of Commons","To ask Mr Chancellor of the Exchequer, what the current number of outstanding business rate appeals lodged with the valuation office is.","false","Biography information for Anneliese Dodds","Oxford East","Anneliese Dodds","6237"
"http://data.parliament.uk/resources/752531","HM Treasury","false","2017-07-20","<p>There are three stages to the new Check, Challenge, Appeal system:</p><ul><li><p>The Check stage allows the business or agent to understand exactly how a valuation has been calculated. It shows all the underlying facts about a property, and allows the business or agent to update the facts about the property if anything has changed. This gives individuals the opportunity to understand and agree the set of facts underlying any valuation, and to resolve any factual issues early.</p></li><li><p>The Challenge stage allows people to challenge the valuation calculated on the basis of the facts agreed at the Check stage, if they feel that the valuation is incorrect. The Challenge stages gives the VOA the opportunity to address and resolve the issue without the need for an appeal. The VOA will present the evidence to support their decision.</p></li><li><p>If ratepayers are still unhappy, having understood all the evidence and basis for the decision made at Challenge, they can Appeal to the independent Valuation Tribunal for England. This appeal will be undertaken on the basis of all the evidence and arguments put forward from both sides at the Challenge stage.</p><p> </p><p>While thousands of people have started using the service to question their valuation, the Valuation Tribunal Service has confirmed that, as at 18 July 2017, no appeals have been made.</p><p> </p></li></ul>","Central Devon","Mel Stride",,"2017-07-20T15:27:04.83Z","http://data.parliament.uk/resources/752531/answer","Biography information for Mel Stride","http://data.parliament.uk/resources/752531/answer",,,"14","Treasury","CaTreasury","2017-07-17","Non-domestic Rates: Appeals","1","House of Commons","To ask Mr Chancellor of the Exchequer, how many appeals against business rates valuation the Valuation Office has received since the check, challenge, appeal system was established; and how many of those appeals were successful.","false","Biography information for Tim Farron","Westmorland and Lonsdale","Tim Farron","5080"
"http://data.parliament.uk/resources/751690","HM Treasury","false","2017-07-20","<p>The new business rates appeals system, Check, Challenge, Appeal came into effect on 1 April 2017. A new system was required because the previous system was broken. Appeals were made with little or no evidence and more than 70% of appeals resulted in no change.</p><p> </p><p>The Check and Challenge service has been delivered by the Valuation Office Agency as a public beta service, meaning that the system is still being improved. The Valuation Office Agency is actively monitoring the service to identify and address any technical issues in the digital system which affect the customer experience. There have been some complaints about technical faults and lack of functionality in relation to the new service, which are being addressed.</p><p> </p><p>The service is now working normally and work delayed through these issues is being cleared. Thousands of people have used the system and both Checks and Challenges are being made. I have been assured by the Valuation Office Agency that enhanced functionality and additional features for the service will be released throughout this financial year.</p><p> </p><p>Regarding the effectiveness and value for money of the online service, it is expected that the new way of working will provide longer-term value for money as issues are dealt with earlier in the process and there is reduced incentive for speculative appeals.</p><p> </p>","Central Devon","Mel Stride","4957","2017-07-20T13:46:44.17Z","http://data.parliament.uk/resources/751690/answer","Biography information for Mel Stride","http://data.parliament.uk/resources/751690/answer",,,"14","Treasury","CaTreasury","2017-07-13","Non-domestic Rates: Appeals","1","House of Commons","To ask Mr Chancellor of the Exchequer, what complaints he has received on the new system for contesting Business Rate Appeals; and what steps he has taken in response to those complaints.","false","Biography information for John Spellar","Warley","John Spellar","4956"
