"uri","answering body","answer > is ministerial correction","answer > date of answer","answer > answer text","answer > answering member constituency","answer > answering member printed","answer > grouped question UIN","answer > question first answered","answer > uri","answer > answering member > label","answer > uri","answer > attachment > file name","answer > attachment > title","answer > uri","answer > previous answer version > answering member constituency","answer > previous answer version > answering member printed","answer > previous answer version > uri","answer > previous answer version > answering member > label","answering dept id","answering dept short name","answering dept sort name","date","hansard heading","house id","legislature > pref label","question text","registered interest","tabling member > label","tabling member constituency","tabling member printed","uin"
"http://data.parliament.uk/resources/100680","Ministry of Defence","false","2014-10-28","<p>No service leavers who reside in Northern Ireland have benefitted from the Scheme as Northern Ireland was classified as an overseas location.</p><p> </p><p>However, I am pleased to say that action is in hand to amend the legislation governing the Scheme to extend provision to Northern Ireland service leavers. We anticipate this coming into effect from September 2015.</p>","Broxtowe","Anna Soubry","211683","2014-10-28T17:54:21.2904943Z","http://data.parliament.uk/resources/100680/answer","Biography information for Anna Soubry","http://data.parliament.uk/resources/100680/answer",,,"http://data.parliament.uk/resources/100680/answer",,,,,"11","Defence","Defence","2014-10-23","Veterans: Northern Ireland","1","House of Commons","To ask the Secretary of State for Defence, how many service leavers resident in Northern Ireland have received further and higher educational support under the Service Leavers Scheme funded by his Department.","false","Biography information for Sir Jeffrey M Donaldson","Lagan Valley","Mr Jeffrey M. Donaldson","211681"
"http://data.parliament.uk/resources/100681","Ministry of Defence","false","2014-10-28","<p>The majority of St Lucia Barracks has been transferred to the Office of First Minister/Deputy First Minister as part of the Hillsborough agreement. The remainder is in the process of being transferred.</p>","Broxtowe","Anna Soubry",,"2014-10-28T17:54:59.2794118Z","http://data.parliament.uk/resources/100681/answer","Biography information for Anna Soubry","http://data.parliament.uk/resources/100681/answer",,,"http://data.parliament.uk/resources/100681/answer",,,,,"11","Defence","Defence","2014-10-23","Military Bases: Omagh","1","House of Commons","To ask the Secretary of State for Defence, what steps he has taken to address the issues raised with him by the First Minsiter of Northern Ireland concerning the transfer of the former St Lucia barracks in Omagh to the Northern Ireland Executive.","false","Biography information for Sir Jeffrey M Donaldson","Lagan Valley","Mr Jeffrey M. Donaldson","211682"
"http://data.parliament.uk/resources/100682","Ministry of Defence","false","2014-10-28","<p>No service leavers who reside in Northern Ireland have benefitted from the Scheme as Northern Ireland was classified as an overseas location.</p><p> </p><p>However, I am pleased to say that action is in hand to amend the legislation governing the Scheme to extend provision to Northern Ireland service leavers. We anticipate this coming into effect from September 2015.</p>","Broxtowe","Anna Soubry","211681","2014-10-28T17:54:21.1498379Z","http://data.parliament.uk/resources/100682/answer","Biography information for Anna Soubry","http://data.parliament.uk/resources/100682/answer",,,"http://data.parliament.uk/resources/100682/answer",,,,,"11","Defence","Defence","2014-10-23","Veterans: Northern Ireland","1","House of Commons","To ask the Secretary of State for Defence, for what reason Northern Ireland is defined as an overseas location for the purposes of offering further and higher educational support under the Service Leavers Scheme.","false","Biography information for Sir Jeffrey M Donaldson","Lagan Valley","Mr Jeffrey M. Donaldson","211683"
"http://data.parliament.uk/resources/100690","Ministry of Defence","false","2014-10-28","<p>I refer the hon. Member to the answer I gave on 3 March 2014, (Official Report, column 720W) to the hon. Member for Washington and Sunderland West (Mrs Hodgson).</p><p> </p><p> </p>","Broxtowe","Anna Soubry","211788","2014-10-28T17:55:33.1484291Z","http://data.parliament.uk/resources/100690/answer","Biography information for Anna Soubry","http://data.parliament.uk/resources/100690/answer","20140303 - Hansard extract Maternity Leave.doc","20140303 - Hansard extract on Maternity Leave","http://data.parliament.uk/resources/100690/answer",,,,,"11","Defence","Defence","2014-10-23","Nurseries","1","House of Commons","To ask the Secretary of State for Defence, how many nursery places his Department offers; how many applications there have been for those places in each year since 2010; and how many of the nursery places are occupied.","false","Biography information for Stephen Doughty","Cardiff South and Penarth","Stephen Doughty","211775"
"http://data.parliament.uk/resources/100790","Ministry of Defence","false","2014-10-28","<p>I refer the hon. Member to the answer I gave on 3 March 2014, (Official Report, column 720W) to the hon. Member for Washington and Sunderland West (Mrs Hodgson).</p><p> </p><p> </p>","Broxtowe","Anna Soubry","211775","2014-10-28T17:55:33.4140205Z","http://data.parliament.uk/resources/100790/answer","Biography information for Anna Soubry","http://data.parliament.uk/resources/100790/answer","20140303 - Hansard extract Maternity Leave.doc","20140303 - Hansard extract on Maternity Leave","http://data.parliament.uk/resources/100790/answer",,,,,"11","Defence","Defence","2014-10-23","Nurseries","1","House of Commons","To ask the Secretary of State for Defence, how many nursery places his Department offers; how many applications have there been for such places in each year since 2010; and how many such places currently on offer are occupied.","false","Biography information for Mr Kevan Jones","North Durham","Mr Kevan Jones","211788"
"http://data.parliament.uk/resources/100533","Department for Work and Pensions","false","2014-10-28","<p /> <p>The information asked for is not held.</p><p> </p><p>Below is a table of the number of Asbestos visits by Health and Safety Executive Inspectors. These numbers may include more than one visit to the same premises.</p><p> </p><p>The number of inspections has reduced over the past five years due to a reduction in the number of licence holders from 559 in 2010 to 458 in 2014.</p><p> </p><table><tbody><tr><td><p><strong>Year (April – March)</strong></p></td><td><p><strong>Number of Asbestos visits</strong></p></td></tr><tr><td><p>2010 – 2011</p></td><td><p>1,872</p></td></tr><tr><td><p>2011 – 2012</p></td><td><p>1,755</p></td></tr><tr><td><p>2012 – 2013</p></td><td><p>1,522</p></td></tr><tr><td><p>2013 – 2014</p></td><td><p>1,318</p></td></tr></tbody></table><p> </p>","Forest of Dean","Mr Mark Harper",,"2014-10-28T17:58:04.1787905Z","http://data.parliament.uk/resources/100533/answer","Biography information for Mr Mark Harper","http://data.parliament.uk/resources/100533/answer",,,"http://data.parliament.uk/resources/100533/answer","Forest of Dean","Mr Mark Harper","http://data.parliament.uk/resources/100533/answer/previousversion/24587","Biography information for Mr Mark Harper","29","Work and Pensions","Work and Pensions","2014-10-22","Asbestos","1","House of Commons","To ask the Secretary of State for Work and Pensions, how many premises inspectors of the Health and Safety Executive visited as part of inspections of the licensed removal of asbestos in (a) 2010, (b) 2011, (c) 2012 and (d) 2013.","false","Biography information for Sir Stephen Timms","East Ham","Stephen Timms","211627"
"http://data.parliament.uk/resources/93766","Ministry of Defence","false","2014-10-28","<p>Ships' and submarines' complements are not fixed; they vary, even across a Class, due to equipment fits and in response to specific tasking.</p><p> </p><p>The tables attached show the average number of liability positions for each platform when in its normal operating role.</p><p> </p><p> </p>","Rayleigh and Wickford","Mr Mark Francois","210751 ; 210753 ; 210755 ; 210756 ; 210758 ; 210835 ; 210836 ; 210837 ; 210838 ; 210839 ; 210840 ; 210841","2014-10-28T17:56:26.3400247Z","http://data.parliament.uk/resources/93766/answer","Biography information for Mr Mark Francois","http://data.parliament.uk/resources/93766/answer","20141028 - MOD - Crew compliments of Royal Navy Ships and Submarines by rank and specialisation - 210751.doc","Royal Navy Crew Compliments - 210751","http://data.parliament.uk/resources/93766/answer","Rayleigh and Wickford","Mr Mark Francois","http://data.parliament.uk/resources/93766/answer/previousversion/24058","Biography information for Mr Mark Francois","11","Defence","Defence","2014-10-16","Minesweepers","1","House of Commons","To ask the Secretary of State for Defence, what the crew complement by (a) rank and (b) specialisation is of Sandown class minehunters.","false","Biography information for Lord Soames of Fletching","Mid Sussex","Sir Nicholas Soames","210834"
"http://data.parliament.uk/resources/93767","Ministry of Defence","false","2014-10-28","<p>Ships' and submarines' complements are not fixed; they vary, even across a Class, due to equipment fits and in response to specific tasking.</p><p> </p><p>The tables attached show the average number of liability positions for each platform when in its normal operating role.</p><p> </p><p> </p>","Rayleigh and Wickford","Mr Mark Francois","210751 ; 210753 ; 210755 ; 210756 ; 210758 ; 210834 ; 210836 ; 210837 ; 210838 ; 210839 ; 210840 ; 210841","2014-10-28T17:56:26.8118886Z","http://data.parliament.uk/resources/93767/answer","Biography information for Mr Mark Francois","http://data.parliament.uk/resources/93767/answer","20141028 - MOD - Crew compliments of Royal Navy Ships and Submarines by rank and specialisation - 210751.doc","Royal Navy Crew Compliments - 210751","http://data.parliament.uk/resources/93767/answer","Rayleigh and Wickford","Mr Mark Francois","http://data.parliament.uk/resources/93767/answer/previousversion/24055","Biography information for Mr Mark Francois","11","Defence","Defence","2014-10-16","Patrol Craft","1","House of Commons","To ask the Secretary of State for Defence, what the crew complement by (a) rank and (b) specialisation is of River class patrol vessels.","false","Biography information for Lord Soames of Fletching","Mid Sussex","Sir Nicholas Soames","210835"
"http://data.parliament.uk/resources/93768","Ministry of Defence","false","2014-10-28","<p>Ships' and submarines' complements are not fixed; they vary, even across a Class, due to equipment fits and in response to specific tasking.</p><p> </p><p>The tables attached show the average number of liability positions for each platform when in its normal operating role.</p><p> </p><p> </p>","Rayleigh and Wickford","Mr Mark Francois","210751 ; 210753 ; 210755 ; 210756 ; 210758 ; 210834 ; 210835 ; 210837 ; 210838 ; 210839 ; 210840 ; 210841","2014-10-28T17:56:27.5174186Z","http://data.parliament.uk/resources/93768/answer","Biography information for Mr Mark Francois","http://data.parliament.uk/resources/93768/answer","20141028 - MOD - Crew compliments of Royal Navy Ships and Submarines by rank and specialisation - 210751.doc","Royal Navy Crew Compliments - 210751","http://data.parliament.uk/resources/93768/answer","Rayleigh and Wickford","Mr Mark Francois","http://data.parliament.uk/resources/93768/answer/previousversion/24056","Biography information for Mr Mark Francois","11","Defence","Defence","2014-10-16","Patrol Craft","1","House of Commons","To ask the Secretary of State for Defence, what the crew complement by (a) rank and (b) specialisation is of Archer class patrol vessels.","false","Biography information for Lord Soames of Fletching","Mid Sussex","Sir Nicholas Soames","210836"
"http://data.parliament.uk/resources/93769","Ministry of Defence","false","2014-10-28","<p>Ships' and submarines' complements are not fixed; they vary, even across a Class, due to equipment fits and in response to specific tasking.</p><p> </p><p>The tables attached show the average number of liability positions for each platform when in its normal operating role.</p><p> </p><p> </p>","Rayleigh and Wickford","Mr Mark Francois","210751 ; 210753 ; 210755 ; 210756 ; 210758 ; 210834 ; 210835 ; 210836 ; 210838 ; 210839 ; 210840 ; 210841","2014-10-28T17:56:27.8956639Z","http://data.parliament.uk/resources/93769/answer","Biography information for Mr Mark Francois","http://data.parliament.uk/resources/93769/answer","20141028 - MOD - Crew compliments of Royal Navy Ships and Submarines by rank and specialisation - 210751.doc","Royal Navy Crew Compliments - 210751","http://data.parliament.uk/resources/93769/answer","Rayleigh and Wickford","Mr Mark Francois","http://data.parliament.uk/resources/93769/answer/previousversion/24057","Biography information for Mr Mark Francois","11","Defence","Defence","2014-10-16","Warships","1","House of Commons","To ask the Secretary of State for Defence, what the crew complement by (a) rank and (b) specialisation is of (i) HMS Echo, (ii) HMS Enterprise, (iii) HMS Scott, (iv) HMSML Gleaner, (v) HMS Protector and (vi) HMS Endurance.","false","Biography information for Lord Soames of Fletching","Mid Sussex","Sir Nicholas Soames","210837"
