"uri","answering body","answer > is ministerial correction","answer > date of answer","answer > answer text","answer > answering member printed","answer > question first answered","answer > question first ministerially corrected","answer > uri","answer > answering member > label","answer > uri","answer > previous answer version > answering member printed","answer > previous answer version > uri","answer > previous answer version > answering member","answer > previous answer version > answering member > uri","answering dept id","answering dept short name","answering dept sort name","date","hansard heading","house id","legislature > pref label","question text","registered interest","tabling member > label","tabling member printed","uin"
"http://data.parliament.uk/resources/1309983","Foreign, Commonwealth and Development Office","false","2021-04-29","<p>Details of UK bilateral Official Development Assistance (ODA) to China between 2009 to 2019 can be found in table A4b of the Statistics on International Development (SID), published on the gov.uk website at</p><p>https://assets.publishing.service.gov.uk/government/uploads/system/uploads/attachment_data/file/920048/Table-A4b.ods. Please note in line with SID revision policy there has been a minor revision to the 2019 SID dataset. A data processing error in reporting meant that the published 2019 figure of UK ODA spend in China was £500,000 lower than the actual spend [as the Grant in Aid ODA for the Great Britain-China Centre (GBCC) was mistakenly attributed to 'developing countries unspecified']. This revision does not affect the headline ODA figure which was £68 million UK bilateral ODA to China in 2019.</p><p>Further details on the programmes that underpin the figures in table A4b, including project titles and descriptions, can be found in the ODA activity level datasets published on gov.uk:</p><p>https://assets.publishing.service.gov.uk/government/uploads/system/uploads/attachment_data/file/921034/Data_Underlying_SID_2019.ods (for 2017-2019) and</p><p>https://assets.publishing.service.gov.uk/government/uploads/system/uploads/attachment_data/file/695435/data-underlying-the-sid2017-revision-March.ods (for 2009 - 2016).</p><p>UK historical ODA spending is collected and published by the OECD. Information on UK ODA spend from 2005 to 2008 can be found online at https://stats.oecd.org/qwids/#?x=2&amp;y=6&amp;f=3:51,4:1,1:23,5:3,7:1&amp;q=3:51+4:1+1:23+5:3+7:1+2:36+6:2005,2006,2007,2008.</p>","Lord Goldsmith of Richmond Park","2021-04-29T11:39:27.603Z",,"http://data.parliament.uk/resources/1309983/answer","Biography information for Lord Goldsmith of Richmond Park","http://data.parliament.uk/resources/1309983/answer",,,,,"208","Foreign, Commonwealth and Development Office","Foreign, Commonwealth and Development Office","2021-04-19","China: Development Aid","2","House of Lords","To ask Her Majesty's Government how much development funding they have provided to China in each of the past 15 years; and what the funding was used for.","false","Biography information for Lord Alton of Liverpool","Lord Alton of Liverpool","HL15028"
"http://data.parliament.uk/resources/1309985","Foreign, Commonwealth and Development Office","false","2021-04-29","<p>The Great Britain China Centre (GBCC) is an arms-length body of the FCDO which currently receives £500K per annum in funding. The Statistics on International Development (SID) provides an overview of official UK spend, dating back to 2009. The 2019 data was published on GOV.UK on 24 September and can be viewed through the following link: https://www.gov.uk/government/statistics/statistics-on-international-development-final-uk-aid-spend-2019). The GBCC supports UK objectives in China, including facilitating dialogues on issues of shared importance, and delivering projects on rule of law and judicial cooperation. The 2019 triennial tailored review of the GBCC concluded that it plays a key role in developing relationships and promoting understanding between the UK and China and has a disproportionate impact on UK-China relations relative to the funding it receives. The GBCC's mandate does not include developing business links with China.</p>","Lord Goldsmith of Richmond Park","2021-04-29T11:40:02.69Z",,"http://data.parliament.uk/resources/1309985/answer","Biography information for Lord Goldsmith of Richmond Park","http://data.parliament.uk/resources/1309985/answer",,,,,"208","Foreign, Commonwealth and Development Office","Foreign, Commonwealth and Development Office","2021-04-19","China: Foreign Relations","2","House of Lords","To ask Her Majesty's Government how much funding they have allocated to the Great Britain China Centre over the last 30 years; how that organisation relates to the Foreign, Commonwealth and Development Office; what assessment they have made of its contribution to diplomatic relations with the government of China; and what steps they take to ensure that human rights and other ethical considerations are taken into account when developing business links with China.","false","Biography information for Lord Alton of Liverpool","Lord Alton of Liverpool","HL15030"
"http://data.parliament.uk/resources/1309991","Foreign, Commonwealth and Development Office","true","2021-04-27","<p>We are concerned about the disappearance of Claudia Uruchurtu, a Mexican national who has been missing since 26 March. Our Ambassador has raised the disappearance with the Mexican authorities at both state and federal levels, and is continuing to do so in support of Claudia's British dual-national family. The Mexican authorities have committed to carrying out an investigation into Claudia's disappearance.</p><p>We are aware that the UN Committee on Enforced Disappearances has issued an urgent action request to the Mexican state to locate Claudia. As Claudia is a Mexican national, and is in Mexico, our authority and responsibility for engaging in this case is limited. However, our Embassy staff in Mexico City are in contact with Claudia's sisters, who are in Mexico helping with the search, and our Embassy team is helping the family access assistance from human rights groups in the area, and from the local UN human rights office.</p>","Lord Goldsmith of Richmond Park","2021-04-27T16:00:51.05Z","2021-04-29T12:20:23.683Z","http://data.parliament.uk/resources/1309991/answer","Biography information for Lord Goldsmith of Richmond Park","http://data.parliament.uk/resources/1309991/answer","Baroness Sugg","http://data.parliament.uk/resources/1309991/answer/previousversion/99950","4584","http://data.parliament.uk/members/4584","208","Foreign, Commonwealth and Development Office","Foreign, Commonwealth and Development Office","2021-04-19","Claudia Uruchurtu","2","House of Lords","To ask Her Majesty's Government what discussions they have had with the government of Mexico about (1) the whereabouts of Claudia Uruchurtu, and (2) the steps it is taking to find her.","false","Biography information for Baroness Clark of Kilwinning","Baroness Clark of Kilwinning","HL15037"
"http://data.parliament.uk/resources/1309992","Foreign, Commonwealth and Development Office","false","2021-04-29","<p>We regularly raise Mr Johal's case directly with the Government of India, including his allegations of torture, his right to a fair trial, and concerns about delays to legal proceedings against him. We have emphasised to the Government of India the need for Mr Johal's torture allegations to be fully investigated. The Foreign Secretary raised Mr Johal's case with the Indian Minister of External Affairs, Subrahmanyam Jaishankar, on 15 December 2020. The Secretary of State for International Trade raised the case with the Indian Minister for Law and Justice, Ravi Shankar Prasad, on 5 February. As the Minister of State for South Asia and the Commonwealth, Lord (Tariq) Ahmad of Wimbledon last raised Mr Johal's case with the Indian High Commissioner on 16 April 2021. He also raised Mr Johal's case with the Indian Minister of State for Home Affairs, Kishan Reddy, and with Minister Prasad on 15 March.</p>","Lord Goldsmith of Richmond Park","2021-04-29T12:20:11.937Z",,"http://data.parliament.uk/resources/1309992/answer","Biography information for Lord Goldsmith of Richmond Park","http://data.parliament.uk/resources/1309992/answer",,,,,"208","Foreign, Commonwealth and Development Office","Foreign, Commonwealth and Development Office","2021-04-19","Jagtar Singh Johal","2","House of Lords","To ask Her Majesty's Government what representations they have made to the government of India about the imprisonment of Jagtar Singh Johal.","false","Biography information for Baroness Clark of Kilwinning","Baroness Clark of Kilwinning","HL15038"
"http://data.parliament.uk/resources/1309993","Foreign, Commonwealth and Development Office","false","2021-04-29","<p>It has not proved possible to respond to this question in the time available before Prorogation. The Minister will write directly to the Member with a response shortly.</p>","Lord Ahmad of Wimbledon","2021-04-29T13:39:50.233Z",,"http://data.parliament.uk/resources/1309993/answer","Biography information for Lord Ahmad of Wimbledon","http://data.parliament.uk/resources/1309993/answer",,,,,"208","Foreign, Commonwealth and Development Office","Foreign, Commonwealth and Development Office","2021-04-19","Hong Kong: Freedom of Association","2","House of Lords","To ask Her Majesty's Government what assessment they have made of the protections for freedom of assembly in Hong Kong under (1) Article 27 of Hong Kong’s Basic Law, and (2) Article 17 of Hong Kong’s Bill of Rights, as a consequence of the Sino-British Joint Declaration 1984; what assessment they have made of the extent to which freedom of assembly in Hong Kong has been infringed during the last two years; and what sanctions they intend to impose on (a) the government of China, and (b) individuals acting on behalf of the government of China, as a consequence of any such infringements.","false","Biography information for Baroness Eaton","Baroness Eaton","HL15039"
"http://data.parliament.uk/resources/1309998","Foreign, Commonwealth and Development Office","false","2021-04-29","<p>We share many of the concerns highlighted in the US House of Representatives' letter to Secretary of State Blinken, not least around freedom of expression and political debate. We are clear in our expectation that Turkey, like all countries, should live up to its human rights obligations towards all its citizens. The Minister for the European Neighbourhood and the Americas raised a range of human rights issues on 21 April with her Turkish counterpart and urged swift implementation of the Human Rights Action Plan published in March. Working with the US and other international partners, we will continue to encourage Turkey, including at Ministerial level, to act in line with the conventions of the Council of Europe and to make greater progress on wider human rights reforms.</p>","Lord Goldsmith of Richmond Park","2021-04-29T12:24:00.843Z",,"http://data.parliament.uk/resources/1309998/answer","Biography information for Lord Goldsmith of Richmond Park","http://data.parliament.uk/resources/1309998/answer",,,,,"208","Foreign, Commonwealth and Development Office","Foreign, Commonwealth and Development Office","2021-04-19","Turkey: Human Rights","2","House of Lords","To ask Her Majesty's Government what assessment they have made of the bipartisan letter signed by 170 members of the US House of Representatives in March, urging the government of the United States of America to address alleged human rights violations in Turkey; and what actions the UK Government will take in response to those allegations.","false","Biography information for Lord Hylton","Lord Hylton","HL15044"
"http://data.parliament.uk/resources/1309999","Foreign, Commonwealth and Development Office","false","2021-04-29","<p>We have regular discussions with Turkish counterparts, including ministers, about human rights issues, where we encourage Turkey to take greater steps to improve its human rights record. The Minister for the European Neighbourhood and the Americas raised a range of human rights issues on 21 April with her Turkish counterpart. We welcomed the publication of Turkey's human rights action plan on 2 March 2021 and urge Turkey to ensure its prompt and thorough implementation.</p><p>Through the UK's Conflict, Stability and Security Fund we have provided capacity building partnerships, and promoted human rights standards, with Turkish government institutions involved in migration management and the labour market, which includes trade unions. This work is supporting an evidence-based approach on tackling child and labour trafficking; fostering the protection of vulnerable migrants in the workplace; and promoting greater access to opportunities in formal labour sectors.</p>","Lord Goldsmith of Richmond Park","2021-04-29T12:24:53.197Z",,"http://data.parliament.uk/resources/1309999/answer","Biography information for Lord Goldsmith of Richmond Park","http://data.parliament.uk/resources/1309999/answer",,,,,"208","Foreign, Commonwealth and Development Office","Foreign, Commonwealth and Development Office","2021-04-19","Turkey: Human Rights","2","House of Lords","To ask Her Majesty's Government whether they have assessed, or plan to assess, the extent to which (1) refugee child labour, (2) child labour by Syrian refugees, and (3) discrimination against trade union members is taking place in Turkey.","false","Biography information for Lord Hylton","Lord Hylton","HL15045"
"http://data.parliament.uk/resources/1310000","Foreign, Commonwealth and Development Office","false","2021-04-29","<p>The UK is a longstanding supporter of the United Nations Relief and Works Agency (UNRWA). We are clear that a fair settlement for Palestinian refugees must be agreed as part of a wider negotiated peace settlement. Until that time, the UK remains firmly committed to supporting UNRWA and Palestinian refugees across Gaza, the West Bank, Jordan, Lebanon and Syria. In Financial Year 2020/2021, the UK provided £63.6m to UNRWA, which includes £7m to the Syria Emergency Appeal and £3.8m to the OPTs Emergency Appeal. Decisions on UK aid to UNRWA in Financial Year 2021/2022 are currently being considered in the context of a temporary overall reduction in Overseas Development Assistance, as announced by the Foreign Secretary on 26 November.</p>","Lord Goldsmith of Richmond Park","2021-04-29T12:25:55.047Z",,"http://data.parliament.uk/resources/1310000/answer","Biography information for Lord Goldsmith of Richmond Park","http://data.parliament.uk/resources/1310000/answer",,,,,"208","Foreign, Commonwealth and Development Office","Foreign, Commonwealth and Development Office","2021-04-19","Palestinians: Refugees","2","House of Lords","To ask Her Majesty's Government what assistance they are providing in the current financial year to the UN Relief and Works Agency for Palestine Refugees; and whether they will publicise the needs of Palestinian refugees in Syria, Lebanon and Jordan.","false","Biography information for Lord Hylton","Lord Hylton","HL15046"
"http://data.parliament.uk/resources/1310001","Foreign, Commonwealth and Development Office","false","2021-04-29","<p>The Government continues to work for the preservation and strengthening of effective arms control, disarmament, and non-proliferation measures, taking into account the prevailing security environment. To that end, we will continue our engagement with civil society and academia. The Government welcomes this project and will follow it with interest.</p>","Lord Goldsmith of Richmond Park","2021-04-29T12:26:26.71Z",,"http://data.parliament.uk/resources/1310001/answer","Biography information for Lord Goldsmith of Richmond Park","http://data.parliament.uk/resources/1310001/answer",,,,,"208","Foreign, Commonwealth and Development Office","Foreign, Commonwealth and Development Office","2021-04-19","Chatham House and Imperial College: Arms Control","2","House of Lords","To ask Her Majesty's Government whether they plan to cooperate with Chatham House and Imperial College on the development of an interactive complex model of the nuclear arms control system; and if not, why not.","false","Biography information for Lord Hylton","Lord Hylton","HL15047"
"http://data.parliament.uk/resources/1310002","Foreign, Commonwealth and Development Office","false","2021-04-29","It has not proved possible to respond to this question in the time available before Prorogation. The Minister will write directly to the Member with a response shortly.","Lord Ahmad of Wimbledon","2021-04-29T13:39:44.337Z",,"http://data.parliament.uk/resources/1310002/answer","Biography information for Lord Ahmad of Wimbledon","http://data.parliament.uk/resources/1310002/answer",,,,,"208","Foreign, Commonwealth and Development Office","Foreign, Commonwealth and Development Office","2021-04-19","Occupied Territories: Coronavirus","2","House of Lords","To ask Her Majesty's Government what measures they plan to put in place to enable more than 20% of the population in the West Bank and Gaza to be vaccinated against COVID-19.","false","Biography information for Lord Hylton","Lord Hylton","HL15048"
