"uri","answering body","answer > is ministerial correction","answer > date of answer","answer > answer text","answer > answering member constituency","answer > answering member printed","answer > question first answered","answer > uri","answer > answering member > label","answer > uri","answer > previous answer version > answering member constituency","answer > previous answer version > answering member printed","answer > previous answer version > uri","answer > previous answer version > answering member > label","answering dept id","answering dept short name","answering dept sort name","date","hansard heading","house id","legislature > pref label","question text","registered interest","tabling member > label","tabling member constituency","tabling member printed","uin"
"http://data.parliament.uk/resources/1010441","Department for Business, Energy and Industrial Strategy","false","2018-11-20","<p>Offshore wind is already bringing high value jobs to coastal communities like Grimsby, for example, from the Triton Knoll project.</p><p> </p><p>Hull has seen 1,000 direct jobs created from the £310 million investment in Siemens’ blade factory.</p><p> </p><p>We are moving to advance discussions with the offshore wind sector around a Sector Deal that ensures higher levels of local content, UK jobs and investment in supply chains, like those in the hon Member’s constituency.</p><p> </p>","Devizes","Claire Perry","2018-11-20T15:19:40.373Z","http://data.parliament.uk/resources/1010441/answer","Biography information for Claire Perry","http://data.parliament.uk/resources/1010441/answer",,,,,"201","Business, Energy and Industrial Strategy","Business, Energy and Industrial Strategy","2018-11-20","Wind Power: Seas and Oceans","1","House of Commons","What steps he is taking to support the offshore wind sector.","false","Biography information for Melanie Onn","Great Grimsby","Melanie Onn","907706"
"http://data.parliament.uk/resources/1010442","Department for Business, Energy and Industrial Strategy","false","2018-11-20","<p>High quality, well paid jobs are a crucial part of our economy and are underpinned by productivity. Our Industrial Strategy sets out a long-term plan to boost productivity by investing in skills, industries and infrastructure.</p><p> </p><p>We have overseen the biggest increase in R&amp;D funding in the last 40 years, committing £7 billion by 2023/2024; have the fastest growing infrastructure investment across the G7; and are providing £37bn of additional capital spending, all of which contribute to the creation of high-quality jobs across the UK.</p>","East Surrey","Mr Sam Gyimah","2018-11-20T15:19:51.38Z","http://data.parliament.uk/resources/1010442/answer","Biography information for Mr Sam Gyimah","http://data.parliament.uk/resources/1010442/answer",,,,,"201","Business, Energy and Industrial Strategy","Business, Energy and Industrial Strategy","2018-11-20","Employment","1","House of Commons","What recent steps he has taken through the Industrial Strategy to increase the number of high-quality, well paid jobs.","false","Biography information for Kevin Foster","Torbay","Kevin Foster","907710"
"http://data.parliament.uk/resources/1010443","Department for Business, Energy and Industrial Strategy","false","2018-11-20","<p>I am very aware of Cornwall’s contribution to the UK economy and I welcome any responsible exploitation of its natural resources including lithium which as my hon Friend knows is a key element in battery technology. That technology has great potential, which we are backing with £246m through a Faraday Challenge to boost expertise in the UK.</p><p> </p><p> </p>","Watford","Richard Harrington","2018-11-20T15:22:05.23Z","http://data.parliament.uk/resources/1010443/answer","Biography information for Lord Harrington of Watford","http://data.parliament.uk/resources/1010443/answer",,,,,"201","Business, Energy and Industrial Strategy","Business, Energy and Industrial Strategy","2018-11-20","Lithium: Cornwall","1","House of Commons","What assessment he has made of the potential contribution of lithium extraction in Cornwall to achieving the aims of the Industrial Strategy.","false","Biography information for Steve Double","St Austell and Newquay","Steve Double","907713"
"http://data.parliament.uk/resources/1010537","Department for Business, Energy and Industrial Strategy","false","2018-11-28","<p>UK government’s action to tackle climate change is framed by the Climate Change Act. This is domestic legislation and is therefore unaffected by exiting the EU.</p><p> </p><p>The UK is committed to international cooperation, including with the EU, on issues of shared interest including climate change.</p>","Devizes","Claire Perry","2018-11-28T15:14:46.943Z","http://data.parliament.uk/resources/1010537/answer","Biography information for Claire Perry","http://data.parliament.uk/resources/1010537/answer",,,,,"201","Business, Energy and Industrial Strategy","Business, Energy and Industrial Strategy","2018-11-20","Climate Change: EU Action","1","House of Commons","To ask the Secretary of State for Business, Energy and Industrial Strategy, whether the Government plans to maintain alignment with EU climate change policy after the UK leaves the EU.","false","Biography information for Thangam Debbonaire","Bristol West","Thangam Debbonaire","193484"
"http://data.parliament.uk/resources/1010538","Department for Business, Energy and Industrial Strategy","false","2018-11-29","<p>Management of fugitive emissions is covered by the Environment Agency permit. As part of the permit application, the operator will need to describe the management of fugitive emissions in an ‘emissions management plan’.</p><p>During operations the operator will be required to undertake environmental monitoring, including emissions monitoring, to demonstrate compliance with their permits. In some cases, depending on the risks presented by a site or community concerns, the Environment Agency may carry out extra monitoring themselves.</p><p>As a further safeguard, the Infrastructure Act 2015 makes it clear that hydraulic fracturing activities cannot take place unless appropriate arrangements have been made for monitoring emissions of methane into the air.</p><p>In addition, the Government is grant funding an environmental monitoring programme led by the British Geological Survey (BGS) in the Fylde (Lancashire) and Kirby Misperton (North Yorkshire), where applications for shale gas wells have been made.</p>","Devizes","Claire Perry","2018-11-29T14:22:57.627Z","http://data.parliament.uk/resources/1010538/answer","Biography information for Claire Perry","http://data.parliament.uk/resources/1010538/answer",,,,,"201","Business, Energy and Industrial Strategy","Business, Energy and Industrial Strategy","2018-11-20","Fracking: Carbon Emissions","1","House of Commons","To ask the Secretary of State for Business, Energy and Industrial Strategy, what assessment he has made of the potential effect on the level of UK carbon emissions of fugitive emissions from fracking.","false","Biography information for Thangam Debbonaire","Bristol West","Thangam Debbonaire","193485"
"http://data.parliament.uk/resources/1010554","Department for Business, Energy and Industrial Strategy","false","2018-11-26","<p>We estimate that around 1.2m homes will be treated under the current Energy Company Obligation between autumn 2018 and March 2022 on the basis of the lifetime bill saving targets that obligated energy suppliers have been set. This is set out on page 27 of the final impact assessment which can be found at: <a href="https://www.gov.uk/government/consultations/energy-company-obligation-eco3-2018-to-2022?6543" target="_blank">https://www.gov.uk/government/consultations/energy-company-obligation-eco3-2018-to-2022?6543</a>. Being a statutory obligation on energy suppliers to meet their targets, we have a high degree of confidence that the lifetime bill savings delivered through installing measures into homes will be met in full. Suppliers have flexibility as to how they phase delivery over the obligation period.</p>","Devizes","Claire Perry","2018-11-26T17:20:19.167Z","http://data.parliament.uk/resources/1010554/answer","Biography information for Claire Perry","http://data.parliament.uk/resources/1010554/answer",,,,,"201","Business, Energy and Industrial Strategy","Business, Energy and Industrial Strategy","2018-11-20","Energy: Housing","1","House of Commons","To ask the Secretary of State for Business, Energy and Industrial Strategy, whether the target of upgrading 200,000 homes per year with energy efficiency measures by 2022 will be met.","false","Biography information for Mr Gregory Campbell","East Londonderry","Mr Gregory Campbell","193387"
"http://data.parliament.uk/resources/1010557","Department for Business, Energy and Industrial Strategy","false","2018-11-26","<p>We are continuing to work with partners across government and across the life sciences sector on an update to the Life Sciences Sector Deal and will publish it in due course.</p>","East Surrey","Mr Sam Gyimah","2018-11-26T14:26:50.383Z","http://data.parliament.uk/resources/1010557/answer","Biography information for Mr Sam Gyimah","http://data.parliament.uk/resources/1010557/answer","East Surrey","Mr Sam Gyimah","http://data.parliament.uk/resources/1010557/answer/previousversion/86891","Biography information for Mr Sam Gyimah","201","Business, Energy and Industrial Strategy","Business, Energy and Industrial Strategy","2018-11-20","Life Sciences","1","House of Commons","To ask the Secretary of State for Business, Energy and Industrial Strategy, when he plans to publish the updated Life Sciences Sector Deal.","false","Biography information for Bill Esterson","Sefton Central","Bill Esterson","193424"
"http://data.parliament.uk/resources/1010558","Department for Business, Energy and Industrial Strategy","false","2018-11-26","<p>We are continuing to work with partners across government and across the life sciences sector on this and all measures included in the update to the Life Sciences Sector Deal will be set out in full at publication.</p>","East Surrey","Mr Sam Gyimah","2018-11-26T14:25:01.787Z","http://data.parliament.uk/resources/1010558/answer","Biography information for Mr Sam Gyimah","http://data.parliament.uk/resources/1010558/answer","East Surrey","Mr Sam Gyimah","http://data.parliament.uk/resources/1010558/answer/previousversion/86892","Biography information for Mr Sam Gyimah","201","Business, Energy and Industrial Strategy","Business, Energy and Industrial Strategy","2018-11-20","Life Sciences: Small Businesses","1","House of Commons","To ask the Secretary of State for Business, Energy and Industrial Strategy, what provisions his Department has included within the updated Life Sciences Sector Deal to support the growth of small businesses.","false","Biography information for Bill Esterson","Sefton Central","Bill Esterson","193425"
"http://data.parliament.uk/resources/1010574","Department for Business, Energy and Industrial Strategy","false","2018-11-28","<p>The Government has no involvement in the day to day running of the Post Office. The Post Office is committed to ensuring all branches across its network offer excellent customer service and has a long history of working with its many franchise partners, including WHSmith to achieve this.</p>","Rochester and Strood","Kelly Tolhurst","2018-11-28T11:36:19.677Z","http://data.parliament.uk/resources/1010574/answer","Biography information for Kelly Tolhurst","http://data.parliament.uk/resources/1010574/answer",,,,,"201","Business, Energy and Industrial Strategy","Business, Energy and Industrial Strategy","2018-11-20","Post Offices: Standards","1","House of Commons","To ask the Secretary of State for Business, Energy and Industrial Strategy, whether he has made a comparative assessment of the level of customer service provided at post offices operated by (a) the Post Office and (b) WH Smith; and if he will make a statement.","false","Biography information for Mr Roger Godsiff","Birmingham, Hall Green","Mr Roger Godsiff","193371"
"http://data.parliament.uk/resources/1010575","Department for Business, Energy and Industrial Strategy","false","2018-11-23","<p>This data will be published in due course.</p>","Watford","Richard Harrington","2018-11-23T11:36:50.58Z","http://data.parliament.uk/resources/1010575/answer","Biography information for Lord Harrington of Watford","http://data.parliament.uk/resources/1010575/answer",,,,,"201","Business, Energy and Industrial Strategy","Business, Energy and Industrial Strategy","2018-11-20","Government Departments: Iron and Steel","1","House of Commons","To ask the Secretary of State for Business, Energy and Industrial Strategy, when his Department will publish data on Government steel use and compliance with procurement policy.","false","Biography information for Gill Furniss","Sheffield, Brightside and Hillsborough","Gill Furniss","193503"
