"uri","answering body","answer > is ministerial correction","answer > date of answer","answer > answer text","answer > answering member printed","answer > question first answered","answer > question first ministerially corrected","answer > uri","answer > answering member > label","answer > uri","answer > previous answer version > answering member printed","answer > previous answer version > uri","answer > previous answer version > answering member > label","answering dept id","answering dept short name","answering dept sort name","date","hansard heading","house id","legislature > pref label","question text","registered interest","tabling member > label","tabling member printed","uin"
"http://data.parliament.uk/resources/1005590","Cabinet Office","false","2018-11-26","<p>There are a number of similarities in what Wales are currently doing in relation to the Future Generations Act, and what the Department for Environment, Food and Rural Affairs (DEFRA) proposes to do within the Environment (Principles and Governance) Bill, which they will publish before Christmas. This includes setting out environmental principles in primary legislation and monitoring the application of the principles. However, the main focus of the Environment (Principles and Governance) Bill is to be broadly equivalent to the governance provided by Europe relating to the environment and this is wider than just considering principles.</p><p> </p><p>We have learnt a great deal from the good work that Wales has done on the Well-Being of Future Generations Act and will continue to do so as we develop our policy statement on the principles as well as wider considerations on environmental governance. This includes reflecting on how the legislative framework is set out and the outcomes that they seek to achieve.</p><p> </p>","Lord Young of Cookham","2018-11-26T17:47:04.997Z",,"http://data.parliament.uk/resources/1005590/answer","Biography information for Lord Young of Cookham","http://data.parliament.uk/resources/1005590/answer",,,,"53","Cabinet Office","Cabinet Office","2018-11-12","Future Generations Commissioner for Wales","2","House of Lords","To ask Her Majesty's Government what lessons they have learned from measures to improve social, economic, environmental and cultural well-being undertaken by the Future Generations Commissioner for Wales.","false","Biography information for Lord Bird","Lord Bird","HL11361"
"http://data.parliament.uk/resources/1002492","Cabinet Office","true","2018-11-20","<p><del class="ministerial">The requested information is not readily available. The information requested can only be provided at disproportionate cost. </del></p><p><ins class="ministerial"><strong><em> </em></strong></ins></p><p><ins class="ministerial">National Security Strategy and Implementation Groups (NSSIGs) were established after the 2017 National Security Capability Review to support the delivery of national security priority programmes, including by better utilising the full range of national security capabilities. Each NSSIG is chaired by a Senior Responsible Official (SRO), who is accountable to the National Security Council.</ins></p><p><ins class="ministerial">The Gulf Delivery Board has not met since the establishment of the Gulf &amp; Iran NSSIG, which subsumed its primary roles and responsibilities in April 2018. Cabinet Office officials are members of the Gulf &amp; Iran NSSIG and attend all meetings. The Cabinet Office also provides some secretariat support to the NSSIG, alongside that provided by the Foreign and Commonwealth Office.</ins></p><p> </p>","Lord Young of Cookham","2018-11-20T16:57:28.727Z","2018-11-20T17:09:59.22Z","http://data.parliament.uk/resources/1002492/answer","Biography information for Lord Young of Cookham","http://data.parliament.uk/resources/1002492/answer","Lord Young of Cookham","http://data.parliament.uk/resources/1002492/answer/previousversion/86171","Biography information for Lord Young of Cookham","53","Cabinet Office","Cabinet Office","2018-11-06","Gulf National Security Secretariat Implementation Group","2","House of Lords","To ask Her Majesty's Government what role, if any, the Gulf National Security Secretariat Implementation Group (NSSIG) has within the Cabinet Office; and how the role and responsibilities of the NSSIG differs from those of the Integrated Delivery Board.","false","Biography information for Lord Scriven","Lord Scriven","HL11333"
"http://data.parliament.uk/resources/1002497","Cabinet Office","false","2018-11-20","<p>The Cabinet Office’s transparency data publications cover the current Prime Minister only. Details of the Prime Minister’s overseas travel are published quarterly and are available on GOV.UK at: <a href="https://www.gov.uk/government/collections/ministers-transparency-publications" target="_blank">https://www.gov.uk/government/collections/ministers-transparency-publications</a></p><p> </p><p>We are unable to provide detailed information on the costs incurred for security to protected individuals or groups. To do so would compromise the integrity of the security arrangements of the individuals concerned.</p>","Lord Young of Cookham","2018-11-20T17:07:34.46Z",,"http://data.parliament.uk/resources/1002497/answer","Biography information for Lord Young of Cookham","http://data.parliament.uk/resources/1002497/answer",,,,"53","Cabinet Office","Cabinet Office","2018-11-06","Former Prime Ministers","2","House of Lords","To ask Her Majesty's Government what costs were incurred in relation to each former Prime Minister for (1) policing, and (2) transport, including use of the RAF Voyager aircraft reserved for royal and government travel in each of the last three years.","false","Biography information for Lord Stevens of Ludgate","Lord Stevens of Ludgate","HL11338"
"http://data.parliament.uk/resources/1002498","Cabinet Office","false","2018-11-20","<p><strong>The requested information is not readily available. The information requested can only be provided at disproportionate cost.</strong></p>","Lord Young of Cookham","2018-11-20T17:07:56.333Z",,"http://data.parliament.uk/resources/1002498/answer","Biography information for Lord Young of Cookham","http://data.parliament.uk/resources/1002498/answer",,,,"53","Cabinet Office","Cabinet Office","2018-11-06","Parliamentary Questions","2","House of Lords","To ask Her Majesty's Government how many (1) oral questions, and (2) written questions, tabled by members of the House of Lords they considered not to relate to matters of Government responsibility in the last 3 months.","false","Biography information for Lord Tebbit","Lord Tebbit","HL11339"
"http://data.parliament.uk/resources/1002242","Cabinet Office","false","2018-11-13","<p>Local Resilience Forums are required under the Civil Contingencies Act to compile and publish community risk registers setting out the main risks in their areas to both raise awareness and guide contingency planning. In doing this, they are guided by, among other things, the National Risk Assessment (NRA) which covers the range of risks that could cause a civil emergency in the UK, and provides a list of the common consequences of these risks in the form of planning assumptions. These cover the maximum scale, duration and impact that could reasonably be expected to occur as a result of emergencies.</p><p>The NRA is classified for national security reasons, and it is therefore not possible to share details of the reasonable worst-case scenarios or planning assumptions. A declassified version is available in the form of the <a href="https://www.gov.uk/government/publications/national-risk-register-for-civil-emergencies-2015-edition" target="_blank">National Risk Register of Civil Emergencies</a> (NRR). This is also provided to the local planning community, and has been placed in the House of Lords Library. Most Community Risk Registers are also available online.</p><p><strong> </strong></p>","Lord Young of Cookham","2018-11-13T16:52:27.177Z",,"http://data.parliament.uk/resources/1002242/answer","Biography information for Lord Young of Cookham","http://data.parliament.uk/resources/1002242/answer",,,,"53","Cabinet Office","Cabinet Office","2018-11-05","Local Resilience Forums: Emergencies","2","House of Lords","To ask Her Majesty's Government what are the reasonable worst-case scenarios that they have asked local resilience forums to work on.","false","Biography information for Lord Kennedy of Southwark","Lord Kennedy of Southwark","HL11263"
"http://data.parliament.uk/resources/999751","Cabinet Office","false","2018-11-13","<p>We are grateful to the Forum for its contribution to the debate and its recommendations, which will continue to inform discussions between the UK Government and devolved administrations on the review of intergovernmental relations. We note the Forum's request for a response by 14 January and will respond in due course.</p>","Lord Young of Cookham","2018-11-13T16:54:05.12Z",,"http://data.parliament.uk/resources/999751/answer","Biography information for Lord Young of Cookham","http://data.parliament.uk/resources/999751/answer",,,,"53","Cabinet Office","Cabinet Office","2018-11-01","Interparliamentary Forum on Brexit","2","House of Lords","To ask Her Majesty's Government what assessment they have made of the letter from the Members of the Interparliamentary Forum on Brexit to the Chancellor of the Duchy of Lancaster dated 29 October; and when they intend to respond to that letter and its conclusion that the Joint Ministerial Committee mechanism is not fit for purpose.","false","Biography information for Baroness Hayter of Kentish Town","Baroness Hayter of Kentish Town","HL11196"
"http://data.parliament.uk/resources/999757","Cabinet Office","false","2018-11-13","<p>The Government is committed to making sure that our electoral system is fit for the future. Vulnerabilities cannot be allowed to undermine the integrity of our democracy.</p><p>The success of the voter ID pilots in May this year proves that voter ID is a reasonable and proportionate measure.</p><p>On 3 November the Government announced that eleven local authorities across England would be takiné part in voter ID pilots for the 2019 local elections:</p><p>https://www.gov.uk/government/news/next-round-of-voter-id-pilots-announced-for-2019</p><p>The pilots will give us a deeper understanding of how voter ID will work on a wider scale and what works best for voters. We are paying close attention to the Electoral Commission's recommendations to help inform the development of voter ID.</p>","Lord Young of Cookham","2018-11-13T12:12:03.33Z",,"http://data.parliament.uk/resources/999757/answer","Biography information for Lord Young of Cookham","http://data.parliament.uk/resources/999757/answer",,,,"53","Cabinet Office","Cabinet Office","2018-11-01","Local Government: Elections","2","House of Lords","To ask Her Majesty's Government what plans they have for further voter ID pilots in next year’s local elections; and how lessons learnt from the 2018 pilots will inform decisions regarding any pilots next year.","false","Biography information for Lord Kennedy of Southwark","Lord Kennedy of Southwark","HL11202"
"http://data.parliament.uk/resources/998901","Cabinet Office","false","2018-11-15","<p>There is no central government travel, subsistence and expenses (T,S&amp;E) policy, and as such, rates and allowances are delegated for individual departments to decide upon. In setting their rates departments must be adherent with Section 8 of the Civil Service Management Code (CSMC), Jon Thompson's 2010 review of Civil Service expense policies and The Efficiency and Reform Group Business Travel Policy Principles launched on 20 July 2011.</p><p>As there is no cross-government T,S&amp;E policy, there is no centrally held information on the accommodation allowance paid by departments to non-London based civil servants when they are required to stay in London as part of their employment. This information will be held in individual departments.</p>","Lord Young of Cookham","2018-11-15T13:07:04.437Z",,"http://data.parliament.uk/resources/998901/answer","Biography information for Lord Young of Cookham","http://data.parliament.uk/resources/998901/answer",,,,"53","Cabinet Office","Cabinet Office","2018-10-31","Civil Servants: Allowances","2","House of Lords","To ask Her Majesty's Government what allowance is paid to civil servants from outside London for accommodation when they are required to stay in London as part of their employment.","false","Biography information for Lord Foulkes of Cumnock","Lord Foulkes of Cumnock","HL11153"
"http://data.parliament.uk/resources/998903","Cabinet Office","false","2018-11-13","<p>Government agencies and bodies are made up of both civil servants and non-civil servants. For people serving on government agencies and bodies who are civil servants, the following applies.</p><p>There is no central government travel, subsistence and expenses (T,S&amp;E) policy, and as such, rates and allowances are delegated for individual departments to decide upon. In setting their rates departments must be adherent with Section 8 of the Civil Service Management Code (CSMC), Jon Thompson's 2010 review of Civil Service expense policies and The Efficiency and Reform Group Business Travel Policy Principles launched on 20 July 2011.</p><p>As there is no cross-government T,S&amp;E policy, there is no centrally held information on the accommodation allowance paid by departments to non-London based civil servants serving on government agencies and bodies when they are required to stay in London as part of their employment. This information will be held in individual departments.</p><p>For people serving on government agencies and bodies who are not civil servants, information on travel, subsistence and expenses allowances would not be held centrally within the Civil Service. Although some departments may hold some relevant information about the arrangements in their non-department public bodies.</p>","Lord Young of Cookham","2018-11-13T12:14:24.823Z",,"http://data.parliament.uk/resources/998903/answer","Biography information for Lord Young of Cookham","http://data.parliament.uk/resources/998903/answer",,,,"53","Cabinet Office","Cabinet Office","2018-10-31","Public Sector: Allowances","2","House of Lords","To ask Her Majesty's Government what allowance is paid to people serving on government agencies and bodies who have to stay overnight in London to attend meetings or perform other duties.","false","Biography information for Lord Foulkes of Cumnock","Lord Foulkes of Cumnock","HL11155"
"http://data.parliament.uk/resources/998905","Cabinet Office","false","2018-11-20","<p>The Government has been working to ensure there is legal and operational clarity for political parties and elected representatives, including considering the scope for amendments to secondary legislation on electoral registers to reflect changes made in the Data Protection Act 2018.</p><p> </p><p>We intend to discuss this further with the Parliamentary Parties Panel in due course.</p>","Lord Young of Cookham","2018-11-20T17:56:10.667Z",,"http://data.parliament.uk/resources/998905/answer","Biography information for Lord Young of Cookham","http://data.parliament.uk/resources/998905/answer",,,,"53","Cabinet Office","Cabinet Office","2018-10-31","Electoral Register: Data Protection","2","House of Lords","To ask Her Majesty's Government, further to the Written Answer by Lord Young of Cookham on 5 June (HL7937), what is the status of their review of existing electoral registration legislation; and what discussions on supporting democratic engagement they have held with political parties.","false","Biography information for Lord Gilbert of Panteg","Lord Gilbert of Panteg","HL11157"
