"uri","answering body","answer > is ministerial correction","answer > date of answer","answer > answer text","answer > answering member printed","answer > question first answered","answer > uri","answer > answering member > label","answer > uri","answer > attachment > file name","answer > attachment > title","answering dept id","answering dept short name","answering dept sort name","date","hansard heading","house id","legislature > pref label","question text","registered interest","tabling member > label","tabling member printed","uin"
"http://data.parliament.uk/resources/169313","Foreign and Commonwealth Office","false","2014-12-22","<p>A law banning commercial advertising on paid cable and satellite television channels in Russia will come into force on 1 January 2015. Commentators have suggested that this law will make it difficult for independent television station, Dozhd, to survive. Increasing pressure on independent journalists and news outlets in Russia, including Dozhd, is of great concern. We regularly make our concerns clear in bilateral interactions at all levels. Most recently, I raised concerns about restrictions on the freedom of expression in Russia with the Russian Ambassador on 25 November. In October, the Minister of State for Foreign and Commonwealth Affairs, my right hon. Friend the Member for Aylesbury (Mr Lidington) also raised concerns about this issue with the Russian Ambassador, highlighting the negative impact of restrictive legislation on the freedom of the media.</p>","Lord Wallace of Saltaire","2014-12-22T16:54:50.397Z","http://data.parliament.uk/resources/169313/answer","Biography information for Lord Wallace of Saltaire","http://data.parliament.uk/resources/169313/answer",,,"16","Foreign and Commonwealth Office","Foreign and Commonwealth Office","2014-12-10","Russia","2","House of Lords","To ask Her Majesty’s Government whether they plan to discuss with the government of Russia the issues of freedom of expression and variety of opinions in the media there, in the light of the proposed closure of the last independent television station in that country.","false","Biography information for Lord Hylton","Lord Hylton","HL3599"
"http://data.parliament.uk/resources/169314","Foreign and Commonwealth Office","false","2014-12-31","<p>We remain concerned by all restrictions placed on ethnic minority rights in China, including in the Xinjiang Uyghur Autonomous Region. We are also troubled by reports which suggest that large numbers of Chinese Uyghurs are arriving in neighbouring South East Asian countries and claiming asylum. We regularly raise our concerns with Chinese officials, such as during the UK-China Human Rights Dialogue in May 2014, and with officials from neighbouring countries. We highlight our broader concerns in the Foreign and Commonwealth Office’s Annual Report on Human Rights and Democracy.</p>","Baroness Anelay of St Johns","2014-12-31T11:22:12.337Z","http://data.parliament.uk/resources/169314/answer","Biography information for Baroness Anelay of St Johns","http://data.parliament.uk/resources/169314/answer",,,"16","Foreign and Commonwealth Office","Foreign and Commonwealth Office","2014-12-10","China: Uyghurs","2","House of Lords","To ask Her Majesty’s Government what help they are providing to Uighur refugees.","false","Biography information for Lord Moonie","Lord Moonie","HL3600"
"http://data.parliament.uk/resources/169321","Foreign and Commonwealth Office","false","2014-12-23","<p>The UK’s participation in the Conference was welcomed by many states, non-governmental organisations and parliamentarians. At the Conference, officials listened carefully to the participants, who expressed a very wide range of views. Some argued that the way to achieve the goal of a world without nuclear weapons was to ban weapons now or to fix a timetable for their elimination. This approach fails to take account of the stability and security which nuclear weapons can help to secure. None of us would gain from a loss of that stability. The UK believes that the UN Disarmament Machinery and the Non-Proliferation Treaty provide the right forum for working towards a world without nuclear weapons.</p><p>Our Ambassador to Austria restated our concern at the humanitarian consequences which could result from the use of nuclear weapons. That is why the UK works extremely hard to prevent the use of nuclear weapons; to prevent the proliferation of nuclear weapons; and to keep our own nuclear weapons safe and secure. We are also committed to working towards a world without nuclear weapons. In our Strategic Defence and Security Review in 2010, the Government undertook to reduce the number of warheads we have by the mid-2020s. However, we shall retain a continuous submarine based deterrent, for as long as the global security situation makes it necessary.</p><p>A copy of the UK intervention at the Conference has been placed in the Library of the House and is attached to this response.</p><p> </p>","Lord Wallace of Saltaire","2014-12-23T12:56:09.067Z","http://data.parliament.uk/resources/169321/answer","Biography information for Lord Wallace of Saltaire","http://data.parliament.uk/resources/169321/answer","HL3607-UK Intervention Vienna HINW.docx","UK intervention at International Conference ","16","Foreign and Commonwealth Office","Foreign and Commonwealth Office","2014-12-10","Nuclear Weapons","2","House of Lords","To ask Her Majesty’s Government what positive outcomes they can report from the 3rd International Conference on the Humanitarian Impact of Nuclear Weapons which they attended in Vienna.","false","Biography information for Baroness Miller of Chilthorne Domer","Baroness Miller of Chilthorne Domer","HL3607"
"http://data.parliament.uk/resources/169322","Foreign and Commonwealth Office","false","2014-12-23","<p>The Government believes the Action Plan that resulted from the Nuclear Non-Proliferation Treaty (NPT) 2010 Review Conference, which was agreed by all NPT States Parties, was a success, encompassing over sixty actions related to disarmament, non-proliferation and the peaceful uses of nuclear energy. Since the 2010 Review Conference, the UK has taken a variety of steps in support of progress against that Action Plan. Many of these steps were set out in our statements to the 2014 NPT Preparatory Committee, which are available on the UN Office for Disarmament Affairs website at the following link: <a href="http://papersmart.unmeetings.org/en/secretariat/unoda/npt/third-session-of&amp;not;the-preparatory-committee-2014/statements-(10)/" target="_blank">http://papersmart.unmeetings.org/en/secretariat/unoda/npt/third-session-of¬the-preparatory-committee-2014/statements-(10)/</a>. The UK also published a national report on progress against the Action Plan at the Preparatory Committee; a copy is available in the Library of the House and attached to this response.</p>","Lord Wallace of Saltaire","2014-12-23T12:56:42.377Z","http://data.parliament.uk/resources/169322/answer","Biography information for Lord Wallace of Saltaire","http://data.parliament.uk/resources/169322/answer","UK's national report to the 2014 PrepCom.docx","UK National Report","16","Foreign and Commonwealth Office","Foreign and Commonwealth Office","2014-12-10","Nuclear Non-Proliferation Treaty Review Conference","2","House of Lords","To ask Her Majesty’s Government whether they consider that sufficient progress was made at the 2010 Nuclear Non-Proliferation Treaty Review Conference; and what progress they can report on identified follow-on actions.","false","Biography information for Baroness Miller of Chilthorne Domer","Baroness Miller of Chilthorne Domer","HL3608"
"http://data.parliament.uk/resources/169323","Foreign and Commonwealth Office","false","2014-12-22","<p>The UK takes all of its international obligations seriously. We are still developing our approach to next year’s Nuclear Non-Proliferation Treaty Review Conference, taking account of international developments and consultations with other States Parties. We are also considering the implications for the UK’s approach, given the Review Conference’s concurrent timing with the general election.</p><p> </p>","Lord Wallace of Saltaire","2014-12-22T16:54:16.637Z","http://data.parliament.uk/resources/169323/answer","Biography information for Lord Wallace of Saltaire","http://data.parliament.uk/resources/169323/answer",,,"16","Foreign and Commonwealth Office","Foreign and Commonwealth Office","2014-12-10","Nuclear Non-Proliferation Treaty Review Conference","2","House of Lords","To ask Her Majesty’s Government what steps they will take give a political lead at the Nuclear Non-Proliferation Treaty Review Conference to be held from 28 April to 9 May 2015 in New York, in the light of that conference taking place during the election period.","false","Biography information for Baroness Miller of Chilthorne Domer","Baroness Miller of Chilthorne Domer","HL3609"
"http://data.parliament.uk/resources/169324","Foreign and Commonwealth Office","false","2014-12-22","<p>Our officials actively participated in the Nuclear Non-Proliferation Treaty (NPT) 2014 Preparatory Committee, which provided a valuable opportunity to engage with NPT States Parties on priorities for the Review Conference. The Government’s objectives reflect our overall approach to the NPT: we want to agree further progress towards a world free from nuclear weapons and to highlight our actions in support of this; encourage action that will help to contain any threat of proliferation or non-compliance with the NPT; and support the responsible global expansion of civil nuclear industries. We believe that the NPT is the cornerstone of the international nuclear non-proliferation regime, and we therefore hope that NPT States Parties will be able to agree a consensual outcome balanced across all three mutually-reinforcing pillars to strengthen that position.</p>","Lord Wallace of Saltaire","2014-12-22T16:52:18.167Z","http://data.parliament.uk/resources/169324/answer","Biography information for Lord Wallace of Saltaire","http://data.parliament.uk/resources/169324/answer",,,"16","Foreign and Commonwealth Office","Foreign and Commonwealth Office","2014-12-10","Nuclear Non-Proliferation Treaty Review Conference","2","House of Lords","To ask Her Majesty’s Government what priorities they identified at the Nuclear Non-Proliferation Treaty preparatory committee earlier this year that they will pursue at the Nuclear Non-Proliferation Treaty review itself.","false","Biography information for Baroness Miller of Chilthorne Domer","Baroness Miller of Chilthorne Domer","HL3610"
"http://data.parliament.uk/resources/169325","Foreign and Commonwealth Office","false","2014-12-22","<p>The Government will continue to implement the commitment announced in the 2010 Strategic Defence and Security Review, to reduce the number of operationally available nuclear warheads to no more than 120 and to reduce our overall nuclear weapon stockpile to no more than 180 by the mid 2020s. We will continue our efforts to build confidence between the Nuclear Weapons States (a fundamental foundation for disarmament). As one of those steps to foster mutual trust and confidence, the UK will host the next conference of P5 Nuclear Weapon States in London in February 2015.</p><p>We will also continue to push for entry into force of the Comprehensive Nuclear-Test-Ban Treaty (CTBT), and for negotiations on a Fissile Material Cut-Off Treaty to start in the Conference on Disarmament. In addition, we will take forward our pioneering research into disarmament verification. We have made clear that our goal is a world without nuclear weapons. This goal has to be approached step by step through further reductions by the two States holding the majority of nuclear weapons and through increased confidence between the Nuclear Weapon States.</p><p>We remain fully committed to these efforts, despite the challenges of the current global security environment.</p>","Lord Wallace of Saltaire","2014-12-22T16:52:44.37Z","http://data.parliament.uk/resources/169325/answer","Biography information for Lord Wallace of Saltaire","http://data.parliament.uk/resources/169325/answer",,,"16","Foreign and Commonwealth Office","Foreign and Commonwealth Office","2014-12-10","Nuclear Non-Proliferation Treaty Review Conference","2","House of Lords","To ask Her Majesty’s Government what progress they hope to make on Article VI of the Nuclear Non-Proliferation Treaty next year; and what obstacles they anticipate.","false","Biography information for Baroness Miller of Chilthorne Domer","Baroness Miller of Chilthorne Domer","HL3611"
"http://data.parliament.uk/resources/169327","Foreign and Commonwealth Office","false","2014-12-17","<p>We are concerned by reports of a number of deaths in Paniai on 8 December, apparently following attempts to disperse a group of protesters. We support calls by the Office of the UN High Commissioner for Human Rights for the authorities to conduct an independent and thorough investigation into the incident. <br>We regularly discuss the situation in Papua province with the Indonesian authorities, raise concerns about access for international journalists and non-governmental organisations and encourage a greater focus on resolving disputes through peaceful dialogue. Most recently the Charge d’Affairs visited Papua province on 3-5 December.</p>","Baroness Anelay of St Johns","2014-12-17T17:03:47.297Z","http://data.parliament.uk/resources/169327/answer","Biography information for Baroness Anelay of St Johns","http://data.parliament.uk/resources/169327/answer",,,"16","Foreign and Commonwealth Office","Foreign and Commonwealth Office","2014-12-10","Papua","2","House of Lords","To ask Her Majesty’s Government whether they intend to make representations to the government of Indonesia to encourage it to establish an inquiry into the incident at Paniai, West Papua, on 8 December in which the Indonesian police and military reportedly shot into a crowd; and whether they will encourage that government to allow access to West Papua for non-governmental organisations and the media.","false","Biography information for Lord Harries of Pentregarth","Lord Harries of Pentregarth","HL3613"
"http://data.parliament.uk/resources/169331","Foreign and Commonwealth Office","false","2014-12-17","We are currently aware of three British citizens imprisoned in Bahrain and Foreign and Commonwealth Office officials are providing consular assistance when required.","Baroness Anelay of St Johns","2014-12-17T14:07:49.687Z","http://data.parliament.uk/resources/169331/answer","Biography information for Baroness Anelay of St Johns","http://data.parliament.uk/resources/169331/answer",,,"16","Foreign and Commonwealth Office","Foreign and Commonwealth Office","2014-12-10","Bahrain","2","House of Lords","To ask Her Majesty’s Government, further to the Written Answer by Baroness Anelay of St Johns on 2 December (HL3124), how many British citizens are imprisoned in Bahrain.","false","Biography information for Lord Patten","Lord Patten","HL3617"
