"uri","answering body","answer > is ministerial correction","answer > date of answer","answer > answer text","answer > answering member constituency","answer > answering member printed","answer > question first answered","answer > question first ministerially corrected","answer > uri","answer > answering member > label","answer > uri","answer > attachment > file name","answer > attachment > title","answer > uri","answer > previous answer version > answering member constituency","answer > previous answer version > answering member printed","answer > previous answer version > uri","answer > previous answer version > answering member > label","answering dept id","answering dept short name","answering dept sort name","date","hansard heading","house id","legislature > pref label","question text","registered interest","tabling member > label","tabling member constituency","tabling member printed","uin"
"http://data.parliament.uk/resources/997124","Department of Health and Social Care","false","2018-11-06","<p>Public Health England (PHE) raises public awareness of the impacts of indoor air pollution by supporting activities that aim to change behaviour, such as the annual Clean Air Day, and is working with health partners, such as the National Institute for Health and Care Excellence, World Health Organization and Allergy UK, to improve the evidence on the health impacts of poor indoor air quality which will enhance advice to the public. PHE also promotes awareness about carbon monoxide through the use of blog posts, press releases and social media updates.</p>","Winchester","Steve Brine","2018-11-06T16:28:25.487Z",,"http://data.parliament.uk/resources/997124/answer","Biography information for Steve Brine","http://data.parliament.uk/resources/997124/answer",,,"http://data.parliament.uk/resources/997124/answer",,,,,"17","Health and Social Care","Health and Social Care","2018-11-29","Housing: Health","1","House of Commons","To ask the Secretary of State for Health and Social Care, what steps he is taking to promote public awareness of the the effect on people's health of poor quality indoor environments.","false","Biography information for Jim Shannon","Strangford","Jim Shannon","184965"
"http://data.parliament.uk/resources/1006207","Cabinet Office","true","2018-11-21","<p>The information requested falls within the responsibility of the UK Statistics Authority. I have asked the Authority to reply.</p><p> </p>","Norwich North","Chloe Smith","2018-11-21T12:50:19.553Z","2018-12-12T17:10:40.713Z","http://data.parliament.uk/resources/1006207/answer","Biography information for Chloe Smith","http://data.parliament.uk/resources/1006207/answer","PQ190816 (1).pdf","UKSA Response","http://data.parliament.uk/resources/1006207/answer","Norwich North","Chloe Smith","http://data.parliament.uk/resources/1006207/answer/previousversion/86293","Biography information for Chloe Smith","53","Cabinet Office","Cabinet Office","2018-11-15","Electronic Cigarettes","1","House of Commons","To ask the Minister for the Cabinet Office, what the contribution of the vaping industry is to the economy.","false","Biography information for Andrew Rosindell","Romford","Andrew Rosindell","190816"
"http://data.parliament.uk/resources/1005696","Ministry of Justice","false","2018-11-15","<p>Drug Rehabilitation Requirements (DRRs) include a condition for regular drug testing. However, these are not specific to a drug.</p><p> </p><p>There is good evidence from a Ministry of Justice (MOJ)-Public Health England (PHE) data share that community based drug and alcohol treatment can be effective in reducing reoffending. Recently published experimental statistics show that among those who committed an offence in the two years before undergoing drug or alcohol treatment, there was a 33% reduction in the number of offences they committed in the subsequent two years. Forty-four percent of offenders did not go on to reoffend in the subsequent two years following treatment.</p><p> </p><p>We are working with the Department of Health and Social Care (DHSC), NHS England and PHE to develop a protocol to support greater use of community sentences with treatment requirements (CSTRs) in courts, including DRRs.</p><p> </p><p>The CSTR protocol focuses on reducing reoffending by addressing the health needs of offenders that may be contributing to their offending behaviour. This is operating across five courts within England (as health is devolved in Wales). These sites are Milton Keynes, Northampton, Birmingham, Sefton and Plymouth.</p><p> </p><p>DHSC has led an evaluation of the implementation of the protocol across the five sites, looking at aspects of CSTRs that are working well and changes in the use of CSTRs over the evaluation period. The evaluation report will be published early next year.</p>","South East Cambridgeshire","Lucy Frazer","2018-11-15T17:32:02.453Z",,"http://data.parliament.uk/resources/1005696/answer","Biography information for Lucy Frazer","http://data.parliament.uk/resources/1005696/answer",,,"http://data.parliament.uk/resources/1005696/answer",,,,,"54","Justice","Justice","2018-11-14","Cannabis: Rehabilitation","1","House of Commons","To ask the Secretary of State for Justice, what assessment he has made of the effectiveness of Drug Rehabilitation Requirements with cannabis testing conditions on reducing rates of reoffending.","false","Biography information for Liz Saville Roberts","Dwyfor Meirionnydd","Liz Saville Roberts","190515"
"http://data.parliament.uk/resources/1005930","Cabinet Office","false","2018-11-15","<p>Our world leading National Cyber Security Strategy, supported by £1.9 billion of transformational investment, sets out measures to defend our people, businesses, and assets; deter our adversaries; and develop the skills and capabilities we need.</p><p>Our experts in the National Cyber Security Centre provide a wide range of guidance and support to help public and private sector organisations improve their resilience to cyber attacks.</p><p> </p>","Aylesbury","Mr David Lidington","2018-11-15T10:22:44.287Z",,"http://data.parliament.uk/resources/1005930/answer","Biography information for Sir David Lidington","http://data.parliament.uk/resources/1005930/answer",,,"http://data.parliament.uk/resources/1005930/answer",,,,,"53","Cabinet Office","Cabinet Office","2018-11-13","Cybersecurity: Standards","1","House of Commons","To ask the Minister for the Cabinet Office, what steps the Government is taking to help improve the cyber security of public and private sector organisations.","false","Biography information for Rehman Chishti","Gillingham and Rainham","Rehman Chishti","907571"
"http://data.parliament.uk/resources/1005980","Department for Education","false","2018-11-19","<p>The Education and Skills Funding Agency (ESFA) continues to liaise with the local authority and regional schools commissioner team to monitor improvements in key stage 4 provision in the borough and identify local need. The ESFA also meets regularly with SK College Group to discuss the college’s offer of A level provision at their Knowsley campus. For 2018/19 academic year the college made 68 offers to study academic A levels at its Knowsley campus. Twelve learners progressed to enrol and attend at the college. However, due to low numbers it was financially unviable to deliver at the Knowsley Campus, so the learners access A Level provision on the St Helens Campus via bespoke transport.</p><p>For 2019 the college has committed to continue to promote the development of A level provision at the Knowsley campus and this is being marketed in their prospectus for 2019/20. They now have in place specific branding alongside targeted promotional activities including: a 2019 school leaver prospectus distributed to all local schools, supermarkets, convenience shops, community centres, and libraries; an A level advert in the college adult course guide in December which is distributed to 65,000 local homes across Knowsley and surrounding Liverpool areas; digital ad vans promoting the A level offer prior to college open evenings; and planned and targeted social media campaigns, local press promotions and railing banners. Furthermore, there are specific A level events for local school career advisers and school liaison teams are working directly in feeder borough schools to promote the A level offer.</p>","Guildford","Anne Milton","2018-11-19T16:28:08.877Z",,"http://data.parliament.uk/resources/1005980/answer","Biography information for Anne Milton","http://data.parliament.uk/resources/1005980/answer",,,"http://data.parliament.uk/resources/1005980/answer",,,,,"60","Education","Education","2018-11-13","GCE A-level: Knowsley","1","House of Commons","To ask the Secretary of State for Education, what recent steps his Department has taken to ensure that young people in Knowsley have access to study academic A-level courses within the borough boundaries.","false","Biography information for Maria Eagle","Garston and Halewood","Maria Eagle","190793"
"http://data.parliament.uk/resources/1005981","Foreign and Commonwealth Office","false","2018-11-20","<p>We are aware of continued reports of harassment and mistreatment of members of the Baha'i faith in Iran, including the recent increase in arrests from August 2018 onwards. We regularly call upon Iran to cease harassment of all religious minorities and to fulfil its international and domestic obligations to protect freedom of religion or belief.</p>","North East Bedfordshire","Alistair Burt","2018-11-20T15:55:54.857Z",,"http://data.parliament.uk/resources/1005981/answer","Biography information for Alistair Burt","http://data.parliament.uk/resources/1005981/answer",,,"http://data.parliament.uk/resources/1005981/answer",,,,,"16","Foreign and Commonwealth Office","Foreign and Commonwealth Office","2018-11-13","Iran: Baha'i Faith","1","House of Commons","To ask the Secretary of State for Foreign and Commonwealth Affairs, what assessment his Department has made of the increased use of Tazir laws by the Iranian courts to sentence Baha'i people; and if he will make a statement.","false","Biography information for Mr Alistair Carmichael","Orkney and Shetland","Mr Alistair Carmichael","190813"
"http://data.parliament.uk/resources/1005982","Foreign and Commonwealth Office","false","2018-11-20","<p>We regularly call upon Iran to cease harassment of all religious minorities, including members of the Baha'i faith, and to fulfil its international and domestic obligations to protect freedom of religion or belief. I discussed human rights, including freedom of religion, when I met my Iranian counterpart, Deputy Foreign Minister Abbas Araghchi, in Tehran in September.</p>","North East Bedfordshire","Alistair Burt","2018-11-20T16:04:13.36Z",,"http://data.parliament.uk/resources/1005982/answer","Biography information for Alistair Burt","http://data.parliament.uk/resources/1005982/answer",,,"http://data.parliament.uk/resources/1005982/answer",,,,,"16","Foreign and Commonwealth Office","Foreign and Commonwealth Office","2018-11-13","Iran: Baha'i Faith","1","House of Commons","To ask the Secretary of State for Foreign and Commonwealth Affairs, what recent representations he has made to the Government of Iran on the treatment of Baha'is in that country; and if will he make a statement.","false","Biography information for Mr Alistair Carmichael","Orkney and Shetland","Mr Alistair Carmichael","190814"
"http://data.parliament.uk/resources/1005983","Department of Health and Social Care","false","2018-11-21","<p>All providers of National Health Service-funded healthcare services are expected to meet a range of national standards, other operational standards and quality requirements. These are set out in the NHS Standard Contract along with the consequences of breaches of these. In many cases, the consequence would be a financial sanction.</p><p> </p><p>Since April 2016, most NHS providers agreeing to meet financial control targets as part of the sustainability funding programme are exempt from such sanctions. However, any revenue withheld is reinvested in the local healthcare system.</p>","Wimbledon","Stephen Hammond","2018-11-21T14:47:35.687Z",,"http://data.parliament.uk/resources/1005983/answer","Biography information for Stephen Hammond","http://data.parliament.uk/resources/1005983/answer",,,"http://data.parliament.uk/resources/1005983/answer",,,,,"17","Health and Social Care","Health and Social Care","2018-11-13","Hospitals: Standards","1","House of Commons","To ask the Secretary of State for Health and Social Care, what evidence his Department holds on the effect on the quality of care of fines levied as a result of hospitals breaching targets; and whether he is taking steps to ensure that such fines do not detract from the provision of care to potentially affected populations.","false","Biography information for Anneliese Dodds","Oxford East","Anneliese Dodds","190930"
"http://data.parliament.uk/resources/1005984","Department of Health and Social Care","false","2018-11-21","<p>Several different quality incentive schemes operate in the National Health Service.</p><p> </p><p>The Quality and Outcomes Framework is a voluntary pay for performance scheme within the general practitioner contract. It focuses upon improving the care of patients with one or more of 25 long term conditions. In 2018, NHS England undertook and published a Review of the Quality and Outcomes Framework which drew upon published evidence to evaluate its effectiveness and identify opportunities for reform. The recommendations made in the report are the subject of ongoing discussions with the General Practitioners Committee of the British Medical Association.</p><p> </p><p>The Commissioning for Quality and Innovation (CQUIN) and Quality Premium schemes are intended to drive improvement by providers, and are administered by clinical commissioning groups and NHS England. The indicators in both are routinely reviewed as part of the NHS Planning Round to ensure that the schemes reflect the latest clinical priorities.</p><p> </p><p>CQUIN has demonstrably helped secure improvements in certain areas: e.g. sepsis and venous thromboembolism management, hepatitis C treatment and staff flu vaccinations. However, we are also aware that some indicators have been less impactful, for example where we have pursued complex service changes or goals without a standard implementation method. The schemes are being reviewed with a view to changes in 2019/20.</p>","Gosport","Caroline Dinenage","2018-11-21T14:43:31.11Z",,"http://data.parliament.uk/resources/1005984/answer","Biography information for Dame Caroline Dinenage","http://data.parliament.uk/resources/1005984/answer",,,"http://data.parliament.uk/resources/1005984/answer",,,,,"17","Health and Social Care","Health and Social Care","2018-11-13","Health Services: Standards","1","House of Commons","To ask the Secretary of State for Health and Social Care, what assessment his Department has made of the potential effectiveness of quality incentive schemes in improving the quality of care to patients.","false","Biography information for Anneliese Dodds","Oxford East","Anneliese Dodds","190931"
"http://data.parliament.uk/resources/1005985","Department of Health and Social Care","false","2018-11-21","<p>NHS England launched a 12 week public consultation on the proposed contracting arrangements for integrated care providers (ICPs) on 3 August 2018 which concluded on 26 October. More information is available at the following link:</p><p> </p><p><a href="https://www.engage.england.nhs.uk/consultation/proposed-contracting-arrangements-for-icps/" target="_blank">https://www.engage.england.nhs.uk/consultation/proposed-contracting-arrangements-for-icps/</a></p><p> </p><p>NHS England will publish a response to the consultation following full consideration of responses and feedback.</p><p> </p><p>The consultation documents provide more detail about NHS England’s current proposals for ICPs, including the proposed integrated budget.</p>","Wimbledon","Stephen Hammond","2018-11-21T14:48:51.183Z",,"http://data.parliament.uk/resources/1005985/answer","Biography information for Stephen Hammond","http://data.parliament.uk/resources/1005985/answer",,,"http://data.parliament.uk/resources/1005985/answer",,,,,"17","Health and Social Care","Health and Social Care","2018-11-13","Integrated Care Systems","1","House of Commons","To ask the Secretary of State for Health and Social Care, whether he is taking steps to ensure that the proposed whole population annual budget for Integrated Care Provider contracts does not create (a) incentives to underbid to obtain contracts and (b) other perverse incentives.","false","Biography information for Anneliese Dodds","Oxford East","Anneliese Dodds","190932"
