"uri","answering body","answer > is ministerial correction","answer > date of answer","answer > answer text","answer > answering member constituency","answer > answering member printed","answer > grouped question UIN","answer > question first answered","answer > uri","answer > answering member > label","answer > uri","answer > attachment > file name","answer > attachment > title","answer > uri","answer > previous answer version > answering member constituency","answer > previous answer version > answering member printed","answer > previous answer version > uri","answer > previous answer version > answering member > label","answering dept id","answering dept short name","answering dept sort name","date","hansard heading","house id","legislature > pref label","question text","registered interest","tabling member > label","tabling member constituency","tabling member printed","uin"
"http://data.parliament.uk/resources/783146","Cabinet Office","false","2017-11-16","<p>The Government has already established an Interministerial Group to oversee the development of its Green Paper on Care and Support.</p>","Ashford","Damian Green",,"2017-11-16T15:54:30.63Z","http://data.parliament.uk/resources/783146/answer","Biography information for Damian Green","http://data.parliament.uk/resources/783146/answer",,,"http://data.parliament.uk/resources/783146/answer",,,,,"53","Cabinet Office","Cabinet Office","2017-11-03","Social Services: Finance","1","House of Commons","To ask the Minister for the Cabinet Office, if the Government will establish a group of Ministers and officials to discuss proposals for the long-term funding of social care.","false","Biography information for Mrs Sharon Hodgson","Washington and Sunderland West","Mrs Sharon Hodgson","111274"
"http://data.parliament.uk/resources/783147","Cabinet Office","false","2017-11-29","<p><strong>ANSWER</strong></p><p>Following a search of our paper and electronic records, I have established that the following information is held:</p><p> </p><table><tbody><tr><td><p>Strategic Supplier</p></td><td><p>Debit</p></td><td><p>Comments</p></td></tr><tr><td><p>Accenture</p></td><td><p>£ 43,440.00</p></td></tr><tr><td><p>Amey</p></td><td><p>£ -</p></td></tr><tr><td><p>Arqiva</p></td><td><p>£ -</p></td></tr><tr><td><p>Atkins</p></td><td><p>£ 105,210.00</p></td><td><p>ATKINS LTD, ATKINS MANAGEMENT CONSULTANTS</p></td></tr><tr><td><p>Atos</p></td><td><p>£ 6,583.30</p></td></tr><tr><td><p>Babcock</p></td><td><p>£ -</p></td></tr><tr><td><p>BAE Systems</p></td><td><p>£ 2,080,266.40</p></td><td><p>BAE SYSTEMS, BAE SYSTEMS APPLIED INTELLIGENCE LTD</p></td></tr><tr><td><p>BT Plc</p></td><td><p>£ 916,087.51</p></td><td><p>BT, BT GLOBAL SERVICES 2</p></td></tr><tr><td><p>Capgemini</p></td><td><p>£ 36,751.51</p></td></tr><tr><td><p>Capita</p></td><td><p>£ 24,834,356.30</p></td><td><p>CAPITA, CAPITA BUSINESS SERVICES LTD, CAPITA IT SERVICES LTD, CAPITA RESOURCING LTD</p></td></tr><tr><td><p>Carillion</p></td><td><p>£ -</p></td></tr><tr><td><p>CGI</p></td><td><p>£ 114,599.60</p></td></tr><tr><td><p>DHL</p></td><td><p>£ -</p></td></tr><tr><td><p>DXC</p></td><td><p>£ -</p></td></tr><tr><td><p>Engie</p></td><td><p>£ -</p></td></tr><tr><td><p>Fujitsu</p></td><td><p>£ 8,839,923.10</p></td><td><p>FUJITSU SERVICES, FUJITSU SERVICES LTD</p></td></tr><tr><td><p>G4S</p></td><td><p>£ 345.03</p></td></tr><tr><td><p>IBM</p></td><td><p>£ 20,099.50</p></td></tr><tr><td><p>Interserve</p></td><td><p>£ 6,870,620.25</p></td><td><p>INTERSERVE CATERING SERVICES LTD, INTERSERVE FACILITIES MANAGEMENT LTD</p></td></tr><tr><td><p>ISS Facility Services Ltd</p></td><td><p>£ -</p></td></tr><tr><td><p>Microsoft</p></td><td><p>£ 225,020.71</p></td></tr><tr><td><p>Mitie</p></td><td><p>£ 474,576.51</p></td><td><p>MITIE BUSINESS SERVICES LTD, MITIE FACILITIES SERVICES LTD</p></td></tr><tr><td><p>Motorola</p></td><td><p>£ -</p></td></tr><tr><td><p>Oracle</p></td><td><p>£ -</p></td></tr><tr><td><p>Serco</p></td><td><p>£ 192,925.98</p></td></tr><tr><td><p>Sodexo</p></td><td><p>£ 8,824.36</p></td></tr><tr><td><p>Sopra Steria</p></td><td><p>£ 81,567.79</p></td></tr><tr><td><p>Virgin Media</p></td><td><p>£ 781,401.90</p></td><td><p>VIRGIN MEDIA LTD, VIRGIN MEDIA BUSINESS, VIRGIN MONEY FOUNDATION</p></td></tr><tr><td><p>Vodafone</p></td><td><p>£ 1,494,367.17</p></td></tr></tbody></table>","Romsey and Southampton North","Caroline Nokes",,"2017-11-29T11:17:43.68Z","http://data.parliament.uk/resources/783147/answer","Biography information for Caroline Nokes","http://data.parliament.uk/resources/783147/answer",,,"http://data.parliament.uk/resources/783147/answer",,,,,"53","Cabinet Office","Cabinet Office","2017-11-03","Cabinet Office: Procurement","1","House of Commons","To ask the Minister for the Cabinet Office, what proportion of his Department's spend in the last year has been with Government strategic suppliers.","false","Biography information for Jon Trickett","Hemsworth","Jon Trickett","111278"
"http://data.parliament.uk/resources/783148","Cabinet Office","false","2017-11-14","<p>I refer the honourable Member to the answer I gave on 17 th October in response to Question UIN 107413.</p>","Romsey and Southampton North","Caroline Nokes",,"2017-11-14T10:33:22.547Z","http://data.parliament.uk/resources/783148/answer","Biography information for Caroline Nokes","http://data.parliament.uk/resources/783148/answer",,,"http://data.parliament.uk/resources/783148/answer",,,,,"53","Cabinet Office","Cabinet Office","2017-11-03","Government Departments: Procurement","1","House of Commons","To ask the Minister for the Cabinet Office, what assessment he has made of trends in the level of Government procurement from small and medium-sized enterprises.","false","Biography information for Dan Carden","Liverpool, Walton","Dan Carden","111304"
"http://data.parliament.uk/resources/783149","Cabinet Office","false","2017-11-14","<p>I refer the hon. Member to the reply I gave to the Member for Easington (Mr Morris) on Wednesday 28 June 2017 to written question 358.</p>","Kingswood","Chris Skidmore",,"2017-11-14T11:08:42.11Z","http://data.parliament.uk/resources/783149/answer","Biography information for Chris Skidmore","http://data.parliament.uk/resources/783149/answer",,,"http://data.parliament.uk/resources/783149/answer",,,,,"53","Cabinet Office","Cabinet Office","2017-11-03","Voting Rights: Young People","1","House of Commons","To ask the Minister for the Cabinet Office, what recent assessment he has made of the merits of reducing the voting age to 16 and the effect such a change would have on democratic participation.","false","Biography information for Dan Carden","Liverpool, Walton","Dan Carden","111305"
"http://data.parliament.uk/resources/783150","Cabinet Office","false","2017-11-28","<p>In response to the recent Department of Health consultation on the future use of the CVI, I expressed my support to allow someone to provide their consent for the local authority to use the information to provide support at elections for blind and partially sighted voters, and my officials are currently working with their DH colleagues to determine how this can be implemented.</p><p>Local authorities already hold a register of partially sighted and blind people and are expected to use this information to ensure that election communications are provided to named citizens in accessible formats.</p><p>On 5th September, at the meeting of the All Party Parliamentary Group on Learning Disability, I launched a Call for Evidence to support the Government’s commitment to ensure the electoral system is accessible for all electors. The deadline for responses was 14th November 2017 and around 250 responses have been received.</p><p>The Government, in partnership with the members of the Cabinet-Office-chaired Accessibility of Elections Working Group, which includes representatives from leading charities and key electoral stakeholders, will now review the evidence received and produce a report of key findings and recommendations. The aim is to publish the report in Spring 2018.</p><p> </p>","Kingswood","Chris Skidmore",,"2017-11-28T09:53:53.687Z","http://data.parliament.uk/resources/783150/answer","Biography information for Chris Skidmore","http://data.parliament.uk/resources/783150/answer",,,"http://data.parliament.uk/resources/783150/answer","Kingswood","Chris Skidmore","http://data.parliament.uk/resources/783150/answer/previousversion/22509","Biography information for Chris Skidmore","53","Cabinet Office","Cabinet Office","2017-11-03","Electoral Register: Disability","1","House of Commons","To ask the Minister for the Cabinet Office, what assessment his Department has made of the potential merits of (a) joining up existing disability registers with the electoral register and (b) recording preferences on accessing information on the electoral register.","false","Biography information for Alex Norris","Nottingham North","Alex Norris","111331"
"http://data.parliament.uk/resources/783151","Cabinet Office","false","2017-11-28","<p>Information regarding the total number of unregistered people of voting age is not held by the Government. Only totals for the number of registered electors are held, and these can be accessed through the Office For National Statistics website. It should be noted, however, that registration levels have increased at every General Election since 2005, and the register used for the 2017 General Election was the largest in our history, standing at 46.9 million entries. This is undoubtedly due, in large part, to the introduction of the Government’s Register to Vote website, which has delivered great benefits to electors, making registering to vote simpler and more accessible than ever before.</p><p>It is the Government’s intention to build on this success by publishing a Democratic Engagement Plan in December, which will have the ambition of making the General Election in 2022 the most inclusive to date.</p>","Kingswood","Chris Skidmore",,"2017-11-28T09:54:46.833Z","http://data.parliament.uk/resources/783151/answer","Biography information for Chris Skidmore","http://data.parliament.uk/resources/783151/answer",,,"http://data.parliament.uk/resources/783151/answer","Kingswood","Chris Skidmore","http://data.parliament.uk/resources/783151/answer/previousversion/22510","Biography information for Chris Skidmore","53","Cabinet Office","Cabinet Office","2017-11-03","Electoral Register","1","House of Commons","To ask the Minister for the Cabinet Office, what estimate he has made of the number of eligible people not on the electoral register for the last five general elections in (a) the UK and (b) Nottingham North.","false","Biography information for Alex Norris","Nottingham North","Alex Norris","111332"
"http://data.parliament.uk/resources/783152","Cabinet Office","false","2017-11-14","<p>The information requested falls within the responsibility of the UK Statistics Authority. I have asked the Authority to reply.</p>","Kingswood","Chris Skidmore",,"2017-11-14T11:18:01.29Z","http://data.parliament.uk/resources/783152/answer","Biography information for Chris Skidmore","http://data.parliament.uk/resources/783152/answer","PQ 111409.pdf","UKSA response","http://data.parliament.uk/resources/783152/answer","Kingswood","Chris Skidmore","http://data.parliament.uk/resources/783152/answer/previousversion/21824","Biography information for Chris Skidmore","53","Cabinet Office","Cabinet Office","2017-11-03","Low Pay: North West","1","House of Commons","To ask the Minister for the Cabinet Office, what proportion of people in work in (a) Greater Manchester, (b) the North West and (c) Denton and Reddish constituency earn less than the full-time equivalent of the national living wage.","false","Biography information for Andrew Gwynne","Denton and Reddish","Andrew Gwynne","111409"
"http://data.parliament.uk/resources/783153","Cabinet Office","false","2017-11-30","<p>The most recent annual Armed Forces Continuous Attitude Survey (AFCAS) includes information on self-reported levels of electoral registration. The latest data are that 96 per cent of Officers are registered to vote and 81 per cent of other ranks are registered to vote.</p><p> </p><p>The Government is committed to ensuring that Armed Forces personnel have an equal chance to participate in elections while serving overseas. The Government will publish a democratic engagement strategy in December setting out our plans to continue to improve registration levels, including for Armed Forces personnel.</p>","Kingswood","Chris Skidmore",,"2017-11-30T11:28:55.263Z","http://data.parliament.uk/resources/783153/answer","Biography information for Chris Skidmore","http://data.parliament.uk/resources/783153/answer",,,"http://data.parliament.uk/resources/783153/answer","Kingswood","Chris Skidmore","http://data.parliament.uk/resources/783153/answer/previousversion/22511","Biography information for Chris Skidmore","53","Cabinet Office","Cabinet Office","2017-11-03","Electoral Register: Armed Forces","1","House of Commons","To ask the Minister for the Cabinet Office, what assessment his Department has made of the potential merits of tracking military personnel who are serving overseas on the electoral register.","false","Biography information for Alex Norris","Nottingham North","Alex Norris","111440"
"http://data.parliament.uk/resources/783154","HM Treasury","false","2017-11-13","<p>Information on the amounts paid through working tax credits to people in the Denton and Reddish constituency in each year from 2013 can only be provided at disproportionate cost.</p>","South West Norfolk","Elizabeth Truss",,"2017-11-13T13:59:40.84Z","http://data.parliament.uk/resources/783154/answer","Biography information for Elizabeth Truss","http://data.parliament.uk/resources/783154/answer",,,"http://data.parliament.uk/resources/783154/answer",,,,,"14","Treasury","CaTreasury","2017-11-03","Working Tax Credit: Denton and Reddish","1","House of Commons","To ask Mr Chancellor of the Exchequer, how much has been paid through working tax credits to people in the Denton and Reddish constituency in each year from 2013.","false","Biography information for Andrew Gwynne","Denton and Reddish","Andrew Gwynne","111398"
"http://data.parliament.uk/resources/783155","HM Treasury","false","2017-11-13","<p>HMRC estimates that companies which raised funds under the Enterprise Investment Scheme (EIS) between 2006‑07 and 2015‑16 had a Corporation Tax liability of £95 million in 2015‑16, the latest year for which data are available.</p><p> </p><p>This cannot be considered to be additional tax generated due to EIS, as it does not take account of the additionality or opportunity cost of investment.</p><p> </p><p>The information requested about VAT and PAYE Income Tax is only available at disproportionate cost.</p>","Central Devon","Mel Stride","111393 ; 111394","2017-11-13T16:21:36.467Z","http://data.parliament.uk/resources/783155/answer","Biography information for Mel Stride","http://data.parliament.uk/resources/783155/answer",,,"http://data.parliament.uk/resources/783155/answer",,,,,"14","Treasury","CaTreasury","2017-11-03","Enterprise Investment Scheme","1","House of Commons","To ask Mr Chancellor of the Exchequer, how much has been collected by HM Revenue and Customs in VAT from companies that had previously received Enterprise Investment Scheme tax relief in each of the last 10 years.","false","Biography information for Kit Malthouse","North West Hampshire","Kit Malthouse","111407"
