"uri","answering body","answer > is ministerial correction","answer > date of answer","answer > answer text","answer > answering member printed","answer > uri","answer > attachment > file name","answer > attachment > title","answer > question first answered","answer > uri","answer > answering member > label","answering dept id","answering dept short name","answering dept sort name","date","hansard heading","house id","legislature > pref label","question text","registered interest","tabling member > label","tabling member printed","uin"
"http://data.parliament.uk/resources/1036924","Department for Environment, Food and Rural Affairs","false","2019-01-21","<p>Leaving the EU and the Common Fisheries Policy means that we will be an independent coastal State, able to manage and control who fishes in our waters. We will also have the opportunity to develop a more responsive and adaptive management regime with opportunities to create a more resilient, competitive, profitable fisheries sector, together with a clean, healthy and productive marine environment. The Commission’s most recent policy statement (June 2018) about the State of Play of the Common Fisheries Policy can be found at</p><p> </p><p><a href="https://eur-lex.europa.eu/legal-content/EN/TXT/PDF/?uri=CELEX:52018DC0452&amp;from=EN" target="_blank">https://eur-lex.europa.eu/legal-content/EN/TXT/PDF/?uri=CELEX:52018DC0452&amp;from=EN</a></p><p> </p><p>and</p><p> </p><p><a href="https://eur-lex.europa.eu/legal-content/EN/TXT/PDF/?uri=CELEX:52018SC0329&amp;from=EN" target="_blank">https://eur-lex.europa.eu/legal-content/EN/TXT/PDF/?uri=CELEX:52018SC0329&amp;from=EN</a></p>","Lord Gardiner of Kimble","http://data.parliament.uk/resources/1036924/answer",,,"2019-01-21T12:06:24.03Z","http://data.parliament.uk/resources/1036924/answer","Biography information for Lord Gardiner of Kimble","13","Environment, Food and Rural Affairs","Environment, Food and Rural Affairs","2019-01-07","Fish: Conservation","2","House of Lords","To ask Her Majesty's Government what assessment they have made of the contribution of the Common Fisheries Policy to the preservation of fish stocks in British waters.","false","Biography information for Lord Patten","Lord Patten","HL12566"
"http://data.parliament.uk/resources/1036925","Department for Environment, Food and Rural Affairs","false","2019-01-16","<p>The UK Sea Fisheries Statistics 2017 www.gov.uk/government/statistics/uk-sea-fisheries-annual-statistics-report-2017 - provides information on the UK fishing industry and about the exploitation of fish stocks.</p><p> </p><p>The three key commercially targeted sea fisheries species which would be considered to be in shortest supply determined by scientific advice are:</p><p> </p><p>- North Sea cod</p><p>- Mackerel in the North East Atlantic</p><p>- West Coast horse mackerel</p><p> </p><p>Some bycatch stocks of lower direct commercial importance which are taken in mixed fisheries, such as Celtic Sea cod and Irish Sea whiting, could also be considered as being in short supply.</p>","Lord Gardiner of Kimble","http://data.parliament.uk/resources/1036925/answer",,,"2019-01-16T16:57:37.197Z","http://data.parliament.uk/resources/1036925/answer","Biography information for Lord Gardiner of Kimble","13","Environment, Food and Rural Affairs","Environment, Food and Rural Affairs","2019-01-07","Fish: Conservation","2","House of Lords","To ask Her Majesty's Government, which three species of fish caught for commercial purposes in British waters are in shortest supply.","false","Biography information for Lord Patten","Lord Patten","HL12567"
"http://data.parliament.uk/resources/1007510","Department for International Development","false","2018-11-23","<p>Further to my reply of 2 November, I can confirm that the Civil Society Support Programme through which the UK supported marginalised communities in Ethiopia, including the Manjo, was a multi-donor programme. Contributors alongside DFID for the first phase of the programme were Ireland, Sweden, Norway, Canada and Denmark. The current phase of the programme which will continue to have a focus on marginalised communities including the Manjo will be supported by Ireland, Sweden and Norway.</p><p> </p><p>At this time we believe the Ethiopian government is taking steps to address the challenges which the Manjo and other marginalised groups face, and that continued engagement in-country alongside our international partners is the best course of action. We do not plan to raise the issue in the United Nations at present.</p>","Lord Bates","http://data.parliament.uk/resources/1007510/answer",,,"2018-11-23T14:24:58.623Z","http://data.parliament.uk/resources/1007510/answer","Biography information for Lord Bates","20","International Development","International Development","2018-11-14","Ethiopia: Ethnic Groups","2","House of Lords","To ask Her Majesty's Government, further to the Written Answer by Lord Bates on 2 November (HL10899), whether they are cooperating with other countries in their support of the Manjo people in Southern Ethiopia; and whether they intend to raise the social, political and economic marginalisation of the Manjo people at the United Nations.","false","Biography information for Lord Patten","Lord Patten","HL11509"
"http://data.parliament.uk/resources/1007512","Foreign and Commonwealth Office","false","2018-11-28","<p>The British Embassy in Addis Ababa has been working closely with our international and multilateral partners, and through our bilateral programmes, to increase the levels of investment in Ethiopia. We note the $1.2bn World Bank Operation with Ethiopia was approved on 30 October. The Minister for Africa discussed prospects for this, and economic development more widely, when she represented the UK at our annual bilateral aid talks with Ethiopia on 5 October. During her visit, she announced a £66 million package of UK technical assistance to the economic reform process.</p><p>The Foreign and Commonwealth Office is now finalising the new roles to deliver the new strategic approach to Africa, announced by the Prime Minister on her regional visit. While it is not possible to give final figures at this stage, this is a significant uplift across our African network of posts and will include new roles focussed on supporting growth, trade and economic partnerships in Ethiopia and the Horn of Africa more widely.</p><p> </p>","Lord Ahmad of Wimbledon","http://data.parliament.uk/resources/1007512/answer",,,"2018-11-28T16:31:26.3Z","http://data.parliament.uk/resources/1007512/answer","Biography information for Lord Ahmad of Wimbledon","16","Foreign and Commonwealth Office","Foreign and Commonwealth Office","2018-11-14","Ethiopia: Foreign Relations","2","House of Lords","To ask Her Majesty's Government, further to the Written Answer by Lord Ahmad of Wimbledon on 31 October (HL10897), what assessment they have made of the case for further multilateral partnerships and cooperation to encourage investment in Ethiopia; and how many additional posts for (1) UK officials, and (2) locally engaged staff, have been created at the British Embassy in Addis Ababa.","false","Biography information for Lord Patten","Lord Patten","HL11510"
"http://data.parliament.uk/resources/1002484","Department for Environment, Food and Rural Affairs","false","2018-11-12","<p>The National Flood and Coastal Erosion Risk Management Strategy (attached) sets out the different roles and responsibilities of public and private bodies in flood and coastal erosion risk management in England.</p><p> </p><p> </p><p> </p><p>Defra leads on the development of flood and coastal erosion risk management policy on behalf of the Government.</p><p> </p><p> </p><p> </p><p>The Environment Agency has a strategic overview of the management of all sources of flooding and coastal erosion, details of which can be found in the Strategy. It reports to the Minister annually about flood and coastal erosion risk management; the main reporting responsibilities are set out in Annex 2 of the Strategy. The latest report is attached.</p><p> </p>","Lord Gardiner of Kimble","http://data.parliament.uk/resources/1002484/answer","National Flood and Coastal Erosion Risk Management Strategy.pdf ; Managing flood and coastal erosion risk in England.pdf","National Flood & Coastal Erosion Risk Management ; Managing flood & coastal erosion risks in England","2018-11-12T14:54:08.183Z","http://data.parliament.uk/resources/1002484/answer","Biography information for Lord Gardiner of Kimble","13","Environment, Food and Rural Affairs","Environment, Food and Rural Affairs","2018-11-06","Flood Control","2","House of Lords","To ask Her Majesty's Government, further to the Written Answer by Lord Gardiner of Kimble on 22 October (HL10505), who is responsible for the coordination of the various bodies listed as involved in the mitigation of flood risk; and how is the performance of that responsible body assessed.","false","Biography information for Lord Patten","Lord Patten","HL11325"
"http://data.parliament.uk/resources/1002485","Department for Environment, Food and Rural Affairs","false","2018-11-20","<p>Coastal change, through erosion or flooding, has always been a risk for those living and working by the sea.</p><p> </p><p>The Environment Agency has strategic oversight of Shoreline Management Plans (20 in England), which are the responsibility of Coastal Protection Authorities. These plans set the direction and preferred management option over a 100 year timeframe and are under-pinned by evidence and a high level economic, social, and environmental assessment.</p><p> </p><p>Over the next three years, we and the Environment Agency (EA) are working closely with the coastal authorities, including funding of £1 million, to refresh Shoreline Management Plans, to ensure that there is consistency and that they are using the best, most up to date evidence. This programme will ensure the Shoreline Management Plans and Coastal Protection Authorities remain effective in light of the most recent UK climate change predictions which will be published later this month.</p><p> </p><p>The EA are also funding a £23 million, five year programme of regional coastal monitoring by these groups, to support decision making.</p>","Lord Gardiner of Kimble","http://data.parliament.uk/resources/1002485/answer",,,"2018-11-20T17:48:49.683Z","http://data.parliament.uk/resources/1002485/answer","Biography information for Lord Gardiner of Kimble","13","Environment, Food and Rural Affairs","Environment, Food and Rural Affairs","2018-11-06","Flood Control","2","House of Lords","To ask Her Majesty's Government, further to the Written Answer by Lord Gardiner of Kimble on 22 October (HL10504), whether they intend to establish an independent review of the effectiveness of (1) Coastal Protection Authorities, and (2) Shoreline Management Plans, in managing flood risk.","false","Biography information for Lord Patten","Lord Patten","HL11326"
"http://data.parliament.uk/resources/998922","Department for Transport","false","2018-11-12","<p>The newly created East West Railway Company is in the process of evaluating the economic benefits of the railway. We expect an economic assessment of the next phase of the project, between Bicester and Bedford, to be published in the coming months. Analysis on the Central Section, between Bedford and Cambridge, is also being progressed. East West Railway Company is planning to hold a public consultation on route options for the Central Section in the early part of next year.</p>","Baroness Sugg","http://data.parliament.uk/resources/998922/answer",,,"2018-11-12T16:07:06.703Z","http://data.parliament.uk/resources/998922/answer","Biography information for Baroness Sugg","27","Transport","Transport","2018-10-31","East West Rail Line","2","House of Lords","To ask Her Majesty's Government, further to the Written Answer by Baroness Sugg on 22 October (HL10506), why work to assess the contribution of the East West Rail programme to both regional and national economic growth has not yet been completed; and when it will be completed.","false","Biography information for Lord Patten","Lord Patten","HL11171"
"http://data.parliament.uk/resources/998923","Department for Environment, Food and Rural Affairs","false","2018-11-06","<p>Defra is committed to protecting our trees from pests and diseases and building the resilience of our trees, woods and forests. In May we published a new Tree Health Resilience Strategy. The strategy sets out a joint action plan for how government and others can work together to address threats to tree health, including threats to ash and oak nationally.</p><p> </p><p>One example of joint action is Action Oak, a hugely important partnership of charities, landowners and government, proactively working together to protect and conserve our oak trees for future generations.</p>","Lord Gardiner of Kimble","http://data.parliament.uk/resources/998923/answer",,,"2018-11-06T17:32:09.703Z","http://data.parliament.uk/resources/998923/answer","Biography information for Lord Gardiner of Kimble","13","Environment, Food and Rural Affairs","Environment, Food and Rural Affairs","2018-10-31","Trees: Disease Control","2","House of Lords","To ask Her Majesty's Government what assessment they have made of the need to increase resilience against threats of disease to ash and oak trees in Somerset, Devon and Cornwall; and what plans they have to provide such resilience.","false","Biography information for Lord Patten","Lord Patten","HL11172"
"http://data.parliament.uk/resources/998924","Department for Transport","false","2018-11-12","<p>Network Rail’s CP6 delivery plan, which will cover 2019-2024, is due to be published in March 2019, and will cover new flood resilience schemes.</p>","Baroness Sugg","http://data.parliament.uk/resources/998924/answer",,,"2018-11-12T16:11:47.127Z","http://data.parliament.uk/resources/998924/answer","Biography information for Baroness Sugg","27","Transport","Transport","2018-10-31","Railways: Flood Control","2","House of Lords","To ask Her Majesty's Government, further to the Written Answer by Baroness Sugg on 23 October (HL10503), what new flood resilience schemes are planned in (1) Somerset, (2) Devon, and (3) Cornwall, for each of the next five years.","false","Biography information for Lord Patten","Lord Patten","HL11173"
"http://data.parliament.uk/resources/993369","Foreign and Commonwealth Office","false","2018-10-31","<p>The UK has a strong bilateral partnership with Ethiopia, a key ally in the Horn of Africa. We will continue to invest in growing an equitable relationship, built on shared values, and with the shared aim of creating jobs and increasing prosperity, including by increasing the number of staff at the British Embassy in Addis Ababa.</p><p>Government Ministers regularly meet with their Ethiopian counterparts to discuss cooperation across a range of issues. The Secretary of State for Defence and the Secretary of State for International Development both visited Addis Ababa in August; the latter met with Prime Minister Abiy and discussed, inter-alia, the importance of inclusiveness and establishing accountability as part of his reform agenda. The Minister of State for Africa visited at the beginning of October, participating in constructive Aid Talks, which, while covering the breadth of issues identified in the 2018 Partnership Principles Assessment, focused on the economy. The Minister for Africa also, on 16 October, opened the UK-Ethiopia Trade and Investment Forum here in London, recognising the 80% growth in total trade in goods and services between the UK and Ethiopia in 2017 as a clear signal of our evolving, modern partnership.</p>","Lord Ahmad of Wimbledon","http://data.parliament.uk/resources/993369/answer",,,"2018-10-31T12:08:16.54Z","http://data.parliament.uk/resources/993369/answer","Biography information for Lord Ahmad of Wimbledon","16","Foreign and Commonwealth Office","Foreign and Commonwealth Office","2018-10-22","Ethiopia: Foreign Relations","2","House of Lords","To ask Her Majesty's Government what assessment they have made of the present state of Anglo–Ethiopian relations.","false","Biography information for Lord Patten","Lord Patten","HL10897"
