"uri","answering body","answer > is ministerial correction","answer > date of answer","answer > answer text","answer > answering member printed","answer > question first answered","answer > uri","answer > answering member > label","answer > uri","answer > attachment > file name","answer > attachment > title","answering dept id","answering dept short name","answering dept sort name","date","hansard heading","house id","legislature > pref label","question text","registered interest","tabling member > label","tabling member printed","uin"
"http://data.parliament.uk/resources/1700761","Treasury","false","2024-04-24","<p>The Government is committed to incentivising greater saving and investment, to help hard working people save for their future goals and build greater financial resilience.</p><p> </p><p>The Help to Save scheme was launched in September 2018 and is intended to promote financial resilience among working households on low incomes by supporting them to kickstart a regular, long-term savings habit and build a financial buffer for a rainy day.</p><p>Individuals can also save up to £20,000 into an Individual Savings Account (ISA) each year, and any savings income received within an ISA is tax free. This, along with the Personal Savings Allowance of up to £1,000 for basic rate taxpayers means that around 85% of people with savings income pay no tax on that income.</p><p> </p><p>However, the Government also recognises that people need support to make effective investment decisions. This is why the Government and FCA are working on a joint review of the boundary between financial advice and guidance to ensure people can access appropriate support with their financial decision-making.</p>","Baroness Vere of Norbiton","2024-04-24T14:44:04.443Z","http://data.parliament.uk/resources/1700761/answer","Biography information for Baroness Vere of Norbiton","http://data.parliament.uk/resources/1700761/answer",,,"14","Treasury","Treasury","2024-04-15","Personal Savings","2","House of Lords","To ask His Majesty's Government, following the findings of the Financial Conduct Authority survey indicating a decrease in savings and investing among UK adults, what steps they are taking to help individuals and families save and invest.","false","Biography information for Lord Taylor of Warwick","Lord Taylor of Warwick","HL3813"
"http://data.parliament.uk/resources/1546225","Foreign, Commonwealth and Development Office","false","2022-12-12","<p>Human Rights is a crucial element underpinning the UK's foreign policy. We continue to urge the Palestinian Authority (PA) to respect human rights, Officials from our Consulate-General in Jerusalem regularly raise the need for key legislative and security sector reform to ensure respect for human rights and fundamental freedoms. We encourage the PA to ensure the harmonisation of Palestinian laws with International Human Rights conventions to which it has acceded. As we mark the 16 days of activism against gender-based violence, we are again urging the PA at the highest levels to adopt legislation to ensure the protection and progression of women's rights.</p>","Lord Ahmad of Wimbledon","2022-12-12T17:38:21.043Z","http://data.parliament.uk/resources/1546225/answer","Biography information for Lord Ahmad of Wimbledon","http://data.parliament.uk/resources/1546225/answer",,,"208","Foreign, Commonwealth and Development Office","Foreign, Commonwealth and Development Office","2022-11-28","Palestinians: Human Rights and Protest","2","House of Lords","To ask His Majesty's Government what steps they are taking to prevent any breaches of human rights by the Palestinian Authority; and what further steps they are taking to support the right of freedom to protest in the areas administered by that Authority.","false","Biography information for Lord Pickles","Lord Pickles","HL3813"
"http://data.parliament.uk/resources/1366733","Department for Levelling Up, Housing and Communities","false","2021-11-22","<p>We are continuing to work positively and constructively with the Northern Ireland Executive to agree a suitable Freeport model. This will ensure that the model delivers a compelling offer for ports and businesses and their local communities in Northern Ireland.</p>","Lord Greenhalgh","2021-11-22T14:47:58.013Z","http://data.parliament.uk/resources/1366733/answer","Biography information for Lord Greenhalgh","http://data.parliament.uk/resources/1366733/answer",,,"211","Levelling Up, Housing and Communities","Levelling Up, Housing and Communities","2021-11-08","Freeports: Northern Ireland","2","House of Lords","To ask Her Majesty's Government, further to the Written Answer by Lord Greenhalgh on 2 November (HL3296), what legal obligations apply to the Freeports model in Northern Ireland which did not delay the selection of Freeports in England.","false","Biography information for Lord Kilclooney","Lord Kilclooney","HL3813"
"http://data.parliament.uk/resources/1192016","Department for Environment, Food and Rural Affairs","false","2020-05-15","<p>The Government recognises the crucial role that all agricultural sectors are playing during this time.</p><p>As horticulture is part of the agricultural sector, impacts of COVID-19 on the horticulture industry are being overseen by the UK Agricultural Market Monitoring Group, which meets weekly to monitor UK agricultural markets and to provide forewarning of any atypical market movements. During the coronavirus outbreak, this has allowed Defra and the devolved administrations to share the latest stakeholder information and data to ensure we have an evidence base to assess the effects of COVID-19 on the agricultural industry, in specific markets, or geographical regions.</p><p>Officials are having regular meetings with the different agricultural sectors to understand the specific issues affecting each sector. It is clear that the coronavirus pandemic is having an impact on horticulture businesses up and down the country and the Government is acutely aware of the challenges facing parts of the industry at this time. We have been working closely with the Horticultural Trades Association (HTA) on reviewing when and how garden centres can reopen safely and as of May 13<sup>th</sup> 2020, garden centres have been allowed to reopen. This will allow businesses to sell their products directly to the public once again and in doing so bring about the wider benefits to consumers, especially for physical and mental wellbeing, which gardening can bring. There is extensive ongoing engagement being undertaken by the department with representatives from the horticulture supply chain to capture emerging issues and to identify what short-term and long-term support the sector, as a whole, needs.</p><p>We will continue to monitor the situation and to work closely with the sector as restrictions are removed and recovery begins.</p>","Lord Gardiner of Kimble","2020-05-15T10:32:07.627Z","http://data.parliament.uk/resources/1192016/answer","Biography information for Lord Gardiner of Kimble","http://data.parliament.uk/resources/1192016/answer",,,"13","Environment, Food and Rural Affairs","Environment, Food and Rural Affairs","2020-04-30","Horticulture: Coronavirus","2","House of Lords","To ask Her Majesty's Government what assessment they have made of whether horticulture is as critical to the national economy as agriculture; and whether they plan to treat horticulture equally to agriculture in their plans for economic recovery.","false","Biography information for The Earl of Sandwich","The Earl of Sandwich","HL3813"
"http://data.parliament.uk/resources/800426","Department of Health","false","2017-12-18","<p>The Department for Communities and Local Government is working closely with the Department of Health on how we improve access to mental health services for rough sleepers, or those at risk of homelessness in England. The Government has committed over £1 billion until 2020 to local authorities to reduce homelessness and rough sleeping and has supported the Homelessness Reduction Act – due to commence in April 2018. The Act will ensure that people who are in need of assistance get the support they need before becoming homeless.</p><p> </p><p>The Government is also supporting 84 projects, some specifically funding mental health interventions, across 205 district and unitary local authorities in England through its £50 million Homelessness Prevention Programme offering tailored support services for people who need it and rapid support for people to make a sustainable recovery from homelessness.</p><p> </p><p>The Government has also set an aim to halve rough sleeping by 2022 and eliminate it entirely by 2027. We are setting up a rough sleeping and homelessness taskforce and piloting a Housing First approach to tackle rough sleeping.</p><p> </p><p>We expect local authorities, NHS England and clinical commissioning groups to all play a crucial role in achieving this. NHS England has published guidance, <em>People Who Are Homeless: How to register with a doctor (GP)</em>, for general practices and patients to ensure that homeless patients are still able to access primary care services. A copy is attached. Public Health England’s online only guidance <em>Improving health through the home</em> provides a single point of access to wide-ranging authoritative information on data, evaluation, evidence and research related to homelessness to support providers and commissioners, such as good practice prompts for commissioning for homeless people with drug or alcohol problems.</p>","Lord O'Shaughnessy","2017-12-18T16:14:33.227Z","http://data.parliament.uk/resources/800426/answer","Biography information for Lord O'Shaughnessy","http://data.parliament.uk/resources/800426/answer","how-to-register-with-a-gp-homeless.pdf","How to Register with a doctor (GP)","17","Health","Health","2017-12-04","Mental Health Services: Homelessness","2","House of Lords","To ask Her Majesty's Government what assessment they have made of, and what plans they have to improve, mental health services for those who are homeless or rough-sleeping.","false","Biography information for Lord Bird","Lord Bird","HL3813"
"http://data.parliament.uk/resources/651831","Department of Health","false","2016-12-19","<p>The UK National Screening Committee (UK NSC) requests that all members declare any personal or business interests which the public might reasonably think could influence their judgement as part of the activities undertaken for the UK NSC on the conflict of interest form and declaration.</p><p> </p><p>The conflict of interest form further requests for the member to include any personal direct and indirect interests, including close family members and others living in the same household. The form is consistent with those of other scientific advisory committees and upholds the seven principles of public life – the Nolan principles. Members are able to express any changes in situations at any time and are directed to withdraw from any discussions where they feel they cannot act impartially.</p><p> </p><p>Termination of membership from the UK NSC may arise where the Chair takes in good belief that the member has acted dishonestly or under duress to influence a recommendation.</p>","Lord Prior of Brampton","2016-12-19T12:18:19.283Z","http://data.parliament.uk/resources/651831/answer","Biography information for Lord Prior of Brampton","http://data.parliament.uk/resources/651831/answer",,,"17","Health","Health","2016-12-05","National Screening Committee","2","House of Lords","To ask Her Majesty’s Government, further to the Written Answer by Lord Prior of Brampton on 22 November (HL3125), whether the public disclosure of a relevant interest is sufficient in all cases relating to appointments to the UK National Screening Committee; and if not, what types of interest would prevent an individual from being appointed or from continuing to serve on the Committee.","false","Biography information for Lord Shinkwin","Lord Shinkwin","HL3813"
"http://data.parliament.uk/resources/431550","Ministry of Justice","false","2015-12-04","<p>Under section 26 of the Northern Ireland Act 1998 (NIA) the Secretary of State may by order direct that action be taken by a Northern Ireland Minister or department if required for the purpose of giving effect to international obligations. However, international obligations in this context are defined as <em>“any international obligations of the United Kingdom other than obligations to observe and implement EU law or the Convention rights” </em>(Section 98 of the NIA). As such, the power under section 26 cannot be used for the purpose of bringing about action in Northern Ireland to comply with the European Convention on Human Rights.</p>","Lord Faulks","2015-12-04T14:10:00.437Z","http://data.parliament.uk/resources/431550/answer","Biography information for Lord Faulks","http://data.parliament.uk/resources/431550/answer",,,"54","Justice","Justice","2015-11-23","European Convention on Human Rights: Northern Ireland","2","House of Lords","To ask Her Majesty’s Government, further to the Answer by Lord Faulks on 18 November (HL Deb, col 133), what is their assessment of whether they have the power under section 26 of the Northern Ireland Act 1998 to give direction to the devolved institutions in Northern Ireland to secure their compliance with the European Human Rights Conventions; and whether the Secretary of State has considered exercising any such power to secure full compliance in Northern Ireland with its obligations under the Convention in relation to equal marriage, blasphemy and defamation.","false","Biography information for Lord Lester of Herne Hill","Lord Lester of Herne Hill","HL3813"
"http://data.parliament.uk/resources/170866","Foreign and Commonwealth Office","false","2014-12-31","<p>We condemn the statement by senior Hamas leader, Khalil al-Hayya, on 14 December claiming that &quot;the illusion of Israel will be removed&quot; by Hamas' military wing.</p><p>The Government's policy on Hamas has not changed and is clear: Hamas must renounce violence, recognise Israel and accept previously signed agreements. We believe that only a negotiated two-state solution will resolve the Israeli-Palestinian conflict once and for all and end the occupation.</p><p> </p>","Baroness Anelay of St Johns","2014-12-31T11:23:03.923Z","http://data.parliament.uk/resources/170866/answer","Biography information for Baroness Anelay of St Johns","http://data.parliament.uk/resources/170866/answer",,,"16","Foreign and Commonwealth Office","Foreign and Commonwealth Office","2014-12-16","Middle East","2","House of Lords","To ask Her Majesty’s Government what action they plan to take to protect the viability of the two-state solution, in the light of the statement by the Hamas leadership on 14 December that they are intent on the destruction of Israel.","false","Biography information for Lord Turnberg","Lord Turnberg","HL3813"
