"uri","answering body","answer > is ministerial correction","answer > date of answer","answer > answer text","answer > answering member constituency","answer > answering member printed","answer > question first answered","answer > uri","answer > answering member > label","answer > uri","answer > attachment > file name","answer > attachment > title","answering dept id","answering dept short name","answering dept sort name","date","hansard heading","house id","legislature > pref label","question text","registered interest","tabling member > label","tabling member constituency","tabling member printed","uin"
"http://data.parliament.uk/resources/1019524","Department for Transport","false","2018-12-06","<p>There were 5 fatalities in accidents where the contributory factor ‘emergency vehicle on a call’ was reported in Great Britain in 2017.</p><p> </p><p>The Department collects data on personal injury road accidents reported to the police, including contributory factors which the police select when they attend the scene. This does not assign blame for the accident but gives an indication of factors the attending officer thought contributed to the accident.</p><p> </p><p>Not all accidents are included in the contributory factor data; only accidents where the police attended the scene and reported at least one contributory factor are included. A total of 72 per cent of accidents reported to the police in 2017 in Great Britain met these criteria.</p><p> </p><p>Published table RAS50007 provides information on casualties in reported road accidents by contributory factor and severity in Great Britain: <a href="https://assets.publishing.service.gov.uk/government/uploads/system/uploads/attachment_data/file/743101/ras50007.ods" target="_blank">https://assets.publishing.service.gov.uk/government/uploads/system/uploads/attachment_data/file/743101/ras50007.ods</a>.</p><p> </p><p>Figures for 2018 will be published in 2019.</p>","Hereford and South Herefordshire","Jesse Norman","2018-12-06T15:41:38.7Z","http://data.parliament.uk/resources/1019524/answer","Biography information for Jesse Norman","http://data.parliament.uk/resources/1019524/answer",,,"27","Transport","Transport","2018-12-04","Emergency Services: Vehicles","1","House of Commons","To ask the Secretary of State for Transport, how many people have died as a result of vehicle pursuits by ambulance and police services in (a) 2017 and (b) in each month since January 2018.","false","Biography information for Keith Vaz","Leicester East","Keith Vaz","198179"
"http://data.parliament.uk/resources/1019770","Department for International Trade","false","2018-12-10","<p>The US-Canada Regulatory Cooperation Council is a bilateral forum for US and Canadian governments to identify and recommend opportunities to enhance regulatory cooperation between the two countries. The Government is continuing to meet with both the United States and Canada to discuss strengthening our trade links, including through regulatory cooperation.</p>","Meon Valley","George Hollingbery","2018-12-10T14:33:06.097Z","http://data.parliament.uk/resources/1019770/answer","Biography information for Sir George Hollingbery","http://data.parliament.uk/resources/1019770/answer",,,"202","International Trade","International Trade","2018-12-04","US-Canada Regulatory Cooperation Council","1","House of Commons","To ask the Secretary of State for International Trade, what preparations he is making for meeting with the US-Canada Regulatory Cooperation Council in the event that the UK leaves the EU without a deal.","false","Biography information for Mr Gregory Campbell","East Londonderry","Mr Gregory Campbell","198742"
"http://data.parliament.uk/resources/1019771","Ministry of Defence","false","2018-12-11","<p>University Royal Naval Units hold personnel files in the unit for two years after an Officer Cadet departs. Files are subsequently archived from the two to seven year period, after which they are destroyed.</p><p> </p><p>The Ministry of Defence has established that the University of Aberdeen publishes minutes of the Military Education Committee; while this is non-Departmental information, the minutes do contain the following membership statistics for the Aberdeen URNU:</p><p> </p><table><tbody><tr><td><p>Year</p></td><td><p>Membership</p></td></tr><tr><td><p>December 2008</p></td><td><p>51</p></td></tr><tr><td><p>December 2009</p></td><td><p>51</p></td></tr><tr><td><p>December 2010</p></td><td><p>48</p></td></tr><tr><td><p>November 2011</p></td><td><p>53</p></td></tr><tr><td><p>December 2012</p></td><td><p>28</p></td></tr></tbody></table><p> </p><p>The full minutes are available at the following link:</p><p> </p><p><a href="https://www.abdn.ac.uk/staffnet/governance/military-education-committee-648.php" target="_blank">https://www.abdn.ac.uk/staffnet/governance/military-education-committee-648.php</a></p><p> </p><p> </p>","Bournemouth East","Mr Tobias Ellwood","2018-12-11T16:19:35.173Z","http://data.parliament.uk/resources/1019771/answer","Biography information for Mr Tobias Ellwood","http://data.parliament.uk/resources/1019771/answer",,,"11","Defence","Defence","2018-12-04","University Royal Naval Units: Aberdeen","1","House of Commons","To ask the Secretary of State for Defence, for what reason records of the membership of the University Royal Naval Unit in Aberdeen between 2008 and 2012 were not retained.","false","Biography information for Andrew Bowie","West Aberdeenshire and Kincardine","Andrew Bowie","198913"
"http://data.parliament.uk/resources/1019773","Department for Transport","false","2018-12-12","<p>I have set out my response to John Varley’s independent review on GOV.UK. In this I confirm that I have accepted the recommendation directed at Government and expect Network Rail to rise to the challenge of those within their area of competence.</p><p> </p><p>We will now work with Network Rail and the Office of Rail and Road to agree how these recommendations can be embedded into Network Rail’s performance management arrangements, and in accordance with their own statutory responsibilities for the railways.</p>","Harrogate and Knaresborough","Andrew Jones","2018-12-12T11:33:25.507Z","http://data.parliament.uk/resources/1019773/answer","Biography information for Andrew Jones","http://data.parliament.uk/resources/1019773/answer",,,"27","Transport","Transport","2018-12-04","Railways: Trees","1","House of Commons","To ask the Secretary of State for Transport, with reference to the independent report to his Department on Network Rail’s approach to vegetation management, published on 28 November 2018, whether he has plans to (a) respond to that report and (b) use enforcement powers to implement the recommendations of that report.","false","Biography information for Rachael Maskell","York Central","Rachael Maskell","198889"
"http://data.parliament.uk/resources/1019775","Department for Business, Energy and Industrial Strategy","false","2018-12-10","<p>The Government recognises the critical role that post offices play in communities and for small businesses across the UK. This is why the Government committed to safeguard the post office network and protect existing rural services. The overall number of post offices across the UK remains at its most stable in decades with over 11,500 branches thanks to significant Government investment of over £2 billion since 2010.</p><p>While the Government sets the strategic direction for the Post Office, it allows the company the commercial freedom to deliver this strategy as an independent business. The distribution of branches is an operational matter of commercial judgement for Post Office management team. I have therefore asked Paula Vennells, the Group Chief Executive of Post Office Limited, to write to the hon Member on this matter. A copy of her reply will be placed in the Libraries of the House.</p>","Rochester and Strood","Kelly Tolhurst","2018-12-10T17:52:50.24Z","http://data.parliament.uk/resources/1019775/answer","Biography information for Kelly Tolhurst","http://data.parliament.uk/resources/1019775/answer",,,"201","Business, Energy and Industrial Strategy","Business, Energy and Industrial Strategy","2018-12-04","Post Offices","1","House of Commons","To ask the Secretary of State for Business, Energy and Industrial Strategy, what estimate his Department has made of the number of post office branches that currently have suspended services; and if he will make a statement.","false","Biography information for Steve Reed","Croydon North","Mr Steve Reed","198843"
"http://data.parliament.uk/resources/1019776","Department of Health and Social Care","false","2018-12-10","<p>We are not aware of any local initiatives launched in the National Health Service as a direct result of the 2018 World Conference on Tobacco or Health. As with previous World Conferences, the United Kingdom Government attended the 2018 World Conference to share our experiences as a world leader on tobacco control, and to inform our thinking on future policy development. NHS England has a number of commitments to tackle smoking, as set out in the 2017 Tobacco Control Plan and associated Delivery Plan.</p>","Winchester","Steve Brine","2018-12-10T15:26:54.75Z","http://data.parliament.uk/resources/1019776/answer","Biography information for Steve Brine","http://data.parliament.uk/resources/1019776/answer",,,"17","Health and Social Care","Health and Social Care","2018-12-04","World Conference on Tobacco or Health","1","House of Commons","To ask the Secretary of State for Health and Social Care, what initiatives the NHS has undertaken as a result of the March 2018 World Conference on Tobacco or Health.","false","Biography information for Mr Gregory Campbell","East Londonderry","Mr Gregory Campbell","198743"
"http://data.parliament.uk/resources/1019777","Department for Business, Energy and Industrial Strategy","false","2018-12-10","<p>We are currently undertaking a review of our evidence on levelised costs of electricity generation and this will be completed in due course.</p>","Devizes","Claire Perry","2018-12-10T17:09:07.707Z","http://data.parliament.uk/resources/1019777/answer","Biography information for Claire Perry","http://data.parliament.uk/resources/1019777/answer",,,"201","Business, Energy and Industrial Strategy","Business, Energy and Industrial Strategy","2018-12-04","Electricity Generation: Costs","1","House of Commons","To ask the Secretary of State for Business, Energy and Industrial Strategy, when his Department plans to complete its review of evidence on levelised costs of electricity generation.","false","Biography information for Mr Gregory Campbell","East Londonderry","Mr Gregory Campbell","198744"
"http://data.parliament.uk/resources/1019778","Department for Digital, Culture, Media and Sport","false","2018-12-10","<p>The Department for Digital, Culture, Media and Sport does not hold this information. The responsibility for the over 75 licence fee concession will transfer to the BBC in 2020 and they have released a consultation paper and other papers outlining information about the impact of different options.</p>","Stourbridge","Margot James","2018-12-10T17:07:35.917Z","http://data.parliament.uk/resources/1019778/answer","Biography information for Margot James","http://data.parliament.uk/resources/1019778/answer",,,"10","Digital, Culture, Media and Sport","Digital, Culture, Media and Sport","2018-12-04","Television Licences: Older People","1","House of Commons","To ask the Secretary of State for Digital, Culture, Media and Sport,  how many people aged between 75 and 80 would be affected if the free licence age were raised to 80.","false","Biography information for Mr Gregory Campbell","East Londonderry","Mr Gregory Campbell","198745"
"http://data.parliament.uk/resources/1019779","Cabinet Office","false","2018-12-10","<p>The information requested falls within the responsibility of the UK Statistics Authority. I have asked the Authority to reply and their response will be <strong>placed</strong> in the <strong>Library</strong>.</p>","Norwich North","Chloe Smith","2018-12-10T10:57:54.963Z","http://data.parliament.uk/resources/1019779/answer","Biography information for Chloe Smith","http://data.parliament.uk/resources/1019779/answer","PQ198746 Response (1) (1).pdf","UKSA Response","53","Cabinet Office","Cabinet Office","2018-12-04","Average Earnings","1","House of Commons","To ask the Minister for the Cabinet Office, what the change was in average full-time salary levels in (a) England, (b) Wales, (c) Scotland and (d) Northern Ireland between 2007 and 2017.","false","Biography information for Mr Gregory Campbell","East Londonderry","Mr Gregory Campbell","198746"
"http://data.parliament.uk/resources/1019781","Foreign and Commonwealth Office","false","2018-12-10","<p>The Government is concerned by reports of militarisation of the South China Sea, and any threat or implied threat of force. We monitor the situation and oppose any action which changes the facts on the ground, raises tensions or hinders the chance of peaceful settlement of the disputes. The UK has enduring interests in the region and has a clear interest in regional peace and stability, and respect for freedom of navigation and overflight.</p>","Cities of London and Westminster","Mark Field","2018-12-10T16:11:10.283Z","http://data.parliament.uk/resources/1019781/answer","Biography information for Mark Field","http://data.parliament.uk/resources/1019781/answer",,,"16","Foreign and Commonwealth Office","Foreign and Commonwealth Office","2018-12-04","South China Sea: Military Bases","1","House of Commons","To ask the Secretary of State for Foreign and Commonwealth Affairs, if he will make representations to the Chinese Government on reports that they plan to construct an underwater military facility in the disputed South China Sea territory.","false","Biography information for Mr Gregory Campbell","East Londonderry","Mr Gregory Campbell","198747"
