"uri","answering body","answer > is ministerial correction","answer > date of answer","answer > answer text","answer > answering member constituency","answer > answering member printed","answer > question first answered","answer > question first ministerially corrected","answer > uri","answer > answering member > label","answer > uri","answer > previous answer version > answering member constituency","answer > previous answer version > answering member printed","answer > previous answer version > uri","answer > previous answer version > answering member > label","answering dept id","answering dept short name","answering dept sort name","date","hansard heading","house id","legislature > pref label","question text","registered interest","tabling member > label","tabling member constituency","tabling member printed","uin"
"http://data.parliament.uk/resources/1125234","Department for Work and Pensions","false","2019-05-17","<p>Entitlement to Universal Credit (UC) takes into account individual claimant circumstances, such as income, savings, assets and living arrangements. Should a claimant be held under the Mental Health Act 1983 they may not be eligible for UC.</p><p> </p><p>All claimants, including those who with mental health conditions, receive continuous tailored support through their personal work coaches, and all Departmental staff working with claimants complete extensive training that prepares them for their role. Specific training is provided for working with different vulnerable groups, with guidance to signpost claimants to relevant support, and these circumstances will be recorded on a claimant’s online account.</p>","North Swindon","Justin Tomlinson","2019-05-17T12:18:34.303Z",,"http://data.parliament.uk/resources/1125234/answer","Biography information for Justin Tomlinson","http://data.parliament.uk/resources/1125234/answer",,,,,"29","Work and Pensions","Work and Pensions","2019-05-08","Universal Credit: Mental Illness","1","House of Commons","To ask the Secretary of State for Work and Pensions, what provision her Department makes for universal credit claimants who are held on restriction under the Mental Health Act 1983.","false","Biography information for Thangam Debbonaire","Bristol West","Thangam Debbonaire","252000"
"http://data.parliament.uk/resources/1125235","Department for Transport","false","2019-05-17","<p>It is still our intention to reform the Bus Service Operators Grant when time allows. We are currently in the process of digitalising the existing paper-based claim process in line with Governments Digital by Default agenda.</p>","Wealden","Ms Nusrat Ghani","2019-05-17T11:44:34.07Z",,"http://data.parliament.uk/resources/1125235/answer","Biography information for Ms Nusrat Ghani","http://data.parliament.uk/resources/1125235/answer",,,,,"27","Transport","Transport","2019-05-08","Bus Service Operators Grant","1","House of Commons","To ask the Secretary of State for Transport, pursuant to the Answer of 10 July 2018 to Question 159654, what the timescale is for the next phase of the bus service operators grant reform process.","false","Biography information for Thangam Debbonaire","Bristol West","Thangam Debbonaire","252001"
"http://data.parliament.uk/resources/1125236","Ministry of Housing, Communities and Local Government","false","2019-05-20","<p>The estimate is based on department’s risk based assessment of their disposal opportunities in the Public Land for Housing programme. The Public Land for Housing programme (2015-20) Programme Handbook for Departments and Arm’s Length Bodies August 2018 sets out how risk ratings are defined, and provides guidance on monitoring, reporting and evidence keeping for the programme. All departments actively manage their pipeline of sites for disposal and apply appropriate risk ratings and mitigation strategies. The Programme Handbook is available via the gov.uk webpages.</p>","Old Bexley and Sidcup","James Brokenshire","2019-05-20T14:52:56.95Z",,"http://data.parliament.uk/resources/1125236/answer","Biography information for James Brokenshire","http://data.parliament.uk/resources/1125236/answer",,,,,"7","Housing, Communities and Local Government","Housing, Communities and Local Government","2019-05-08","Housing: Construction","1","House of Commons","To ask the Secretary of State for Housing, Communities and Local Government, with reference to the he National Audit's Office press release of 2 May 2019, Investigation into the government’s land disposal strategy and programmes, and its assertion that the Ministry for Housing, Communities and Local Government expects departments to have released enough land for around 65,000 homes by 2020, against a target of at least 160,000, what the evidential basis is for his Department's estimated performance against that target.","false","Biography information for John Healey","Wentworth and Dearne","John Healey","251903"
"http://data.parliament.uk/resources/1125240","Ministry of Justice","true","2019-05-17","<p>In accordance with the sentence of the Court, Joseph McCann was released on 15 February 2019, after he had completed half (less time spent on remand) of a three-year determinate sentence for burglary imposed on 25 January 2018. On release, he was supervised by the National Probation Service (NPS)</p><p> </p><p>When charged with that offence and remanded into custody on 21 August 2017, he was being supervised on licence by the NPS as part of the sentence of Imprisonment for Public Protection (IPP) which he received on 26 September 2008. An offender on an IPP licence is not recalled automatically when he is charged with a further offence or offences. The probation officer will consider whether the alleged further offences, prior offending and the offender’s current behaviour show that his risk has escalated to the point where he needs to be recalled to protect the public. The decision on whether to recall an offender is to be based on a robust assessment of risk and to reflect the professional judgment of a trained probation officer.</p><p> </p><p>The NPS has undertaken an urgent review to establish why Mr McCann was not recalled to custody, either when remanded into custody on 21 August 2017 or when he was sentenced on <ins class="ministerial">25 January 2018</ins> <del class="ministerial">15 February 2018</del>. Mr McCann has now been charged with a number of very serious offences committed on or after 21 April this year. This has triggered a mandatory serious further offence (SFO) review, under the Probation SFO Review Procedures. The SFO review will consider in greater depth than has thus far been possible, including by interviewing relevant members of staff, the question of whether Mr McCann should have been recalled to custody when charged with and subsequently convicted of the burglary offence. Typically, an SFO review is completed within three months of an offender being charged with an SFO.</p><p> </p>","South Swindon","Robert Buckland","2019-05-17T13:45:21.653Z","2019-06-12T14:34:20.463Z","http://data.parliament.uk/resources/1125240/answer","Biography information for Sir Robert Buckland","http://data.parliament.uk/resources/1125240/answer","South Swindon","Robert Buckland","http://data.parliament.uk/resources/1125240/answer/previousversion/118714","Biography information for Sir Robert Buckland","54","Justice","Justice","2019-05-08","Joseph McCann","1","House of Commons","To ask the Secretary of State for Justice, when the decision was taken to release Joseph McCann.","false","Biography information for Richard Burgon","Leeds East","Richard Burgon","252002"
"http://data.parliament.uk/resources/1125241","Ministry of Justice","true","2019-05-17","<p>In accordance with the sentence of the Court, Joseph McCann was released on 15 February 2019, after he had completed half (less time spent on remand) of a three-year determinate sentence for burglary imposed on 25 January 2018. On release, he was supervised by the National Probation Service (NPS)</p><p> </p><p>When charged with that offence and remanded into custody on 21 August 2017, he was being supervised on licence by the NPS as part of the sentence of Imprisonment for Public Protection (IPP) which he received on 26 September 2008. An offender on an IPP licence is not recalled automatically when he is charged with a further offence or offences. The probation officer will consider whether the alleged further offences, prior offending and the offender’s current behaviour show that his risk has escalated to the point where he needs to be recalled to protect the public. The decision on whether to recall an offender is to be based on a robust assessment of risk and to reflect the professional judgment of a trained probation officer.</p><p> </p><p>The NPS has undertaken an urgent review to establish why Mr McCann was not recalled to custody, either when remanded into custody on 21 August 2017 or when he was sentenced on <ins class="ministerial">25 January 2018</ins> <del class="ministerial">15 February 2018</del>. Mr McCann has now been charged with a number of very serious offences committed on or after 21 April this year. This has triggered a mandatory serious further offence (SFO) review, under the Probation SFO Review Procedures. The SFO review will consider in greater depth than has thus far been possible, including by interviewing relevant members of staff, the question of whether Mr McCann should have been recalled to custody when charged with and subsequently convicted of the burglary offence. Typically, an SFO review is completed within three months of an offender being charged with an SFO.</p><p> </p>","South Swindon","Robert Buckland","2019-05-17T13:45:21.73Z","2019-06-12T14:34:30.427Z","http://data.parliament.uk/resources/1125241/answer","Biography information for Sir Robert Buckland","http://data.parliament.uk/resources/1125241/answer","South Swindon","Robert Buckland","http://data.parliament.uk/resources/1125241/answer/previousversion/118715","Biography information for Sir Robert Buckland","54","Justice","Justice","2019-05-08","Joseph McCann","1","House of Commons","To ask the Secretary of State for Justice, who took the decision not to refer the question of Joseph McCann's release to the Parole Board.","false","Biography information for Richard Burgon","Leeds East","Richard Burgon","252003"
"http://data.parliament.uk/resources/1125242","Treasury","false","2019-05-16","<p>To date, the Romanian Presidency has held one official level discussion on the European Commission’s legislative proposal on VAT Rates. As drafted, this proposal would give the UK the flexibility to apply a zero rate of VAT to women’s sanitary products.</p><p> </p><p>During this discussion, the UK delegation made clear that the Government strongly supports the flexibility that the draft legislation would offer. Member States and the Commission are well aware of the Government’s firm commitment to zero rate women’s sanitary products as soon as it is legal to do so.</p>","Central Devon","Mel Stride","2019-05-16T15:07:29.68Z",,"http://data.parliament.uk/resources/1125242/answer","Biography information for Mel Stride","http://data.parliament.uk/resources/1125242/answer",,,,,"14","Treasury","Treasury","2019-05-08","Sanitary Products: VAT","1","House of Commons","To ask the Chancellor of the Exchequer, what representations he has made to the Romanian Presidency on progressing its negotiations on abolishing VAT on sanitary products.","false","Biography information for Alison Thewliss","Glasgow Central","Alison Thewliss","252004"
"http://data.parliament.uk/resources/1125243","Ministry of Justice","true","2019-05-17","<p>In accordance with the sentence of the Court, Joseph McCann was released on 15 February 2019, after he had completed half (less time spent on remand) of a three-year determinate sentence for burglary imposed on 25 January 2018. On release, he was supervised by the National Probation Service (NPS)</p><p> </p><p>When charged with that offence and remanded into custody on 21 August 2017, he was being supervised on licence by the NPS as part of the sentence of Imprisonment for Public Protection (IPP) which he received on 26 September 2008. An offender on an IPP licence is not recalled automatically when he is charged with a further offence or offences. The probation officer will consider whether the alleged further offences, prior offending and the offender’s current behaviour show that his risk has escalated to the point where he needs to be recalled to protect the public. The decision on whether to recall an offender is to be based on a robust assessment of risk and to reflect the professional judgment of a trained probation officer.</p><p> </p><p>The NPS has undertaken an urgent review to establish why Mr McCann was not recalled to custody, either when remanded into custody on 21 August 2017 or when he was sentenced on <ins class="ministerial">25 Jarnuary 2018</ins> <del class="ministerial">15 February 2018</del>. Mr McCann has now been charged with a number of very serious offences committed on or after 21 April this year. This has triggered a mandatory serious further offence (SFO) review, under the Probation SFO Review Procedures. The SFO review will consider in greater depth than has thus far been possible, including by interviewing relevant members of staff, the question of whether Mr McCann should have been recalled to custody when charged with and subsequently convicted of the burglary offence. Typically, an SFO review is completed within three months of an offender being charged with an SFO.</p><p> </p>","South Swindon","Robert Buckland","2019-05-17T13:45:21.767Z","2019-06-12T14:34:40.8Z","http://data.parliament.uk/resources/1125243/answer","Biography information for Sir Robert Buckland","http://data.parliament.uk/resources/1125243/answer","South Swindon","Robert Buckland","http://data.parliament.uk/resources/1125243/answer/previousversion/118716","Biography information for Sir Robert Buckland","54","Justice","Justice","2019-05-08","Joseph McCann","1","House of Commons","To ask the Secretary of State for Justice, what the (a) scope, (b) timescale and (c) remit is of the urgent review into the reported mistaken release of Joseph McCann.","false","Biography information for Richard Burgon","Leeds East","Richard Burgon","252005"
"http://data.parliament.uk/resources/1125244","Ministry of Justice","true","2019-05-17","<p>In accordance with the sentence of the Court, Joseph McCann was released on 15 February 2019, after he had completed half (less time spent on remand) of a three-year determinate sentence for burglary imposed on 25 January 2018. On release, he was supervised by the National Probation Service (NPS)</p><p> </p><p>When charged with that offence and remanded into custody on 21 August 2017, he was being supervised on licence by the NPS as part of the sentence of Imprisonment for Public Protection (IPP) which he received on 26 September 2008. An offender on an IPP licence is not recalled automatically when he is charged with a further offence or offences. The probation officer will consider whether the alleged further offences, prior offending and the offender’s current behaviour show that his risk has escalated to the point where he needs to be recalled to protect the public. The decision on whether to recall an offender is to be based on a robust assessment of risk and to reflect the professional judgment of a trained probation officer.</p><p> </p><p>The NPS has undertaken an urgent review to establish why Mr McCann was not recalled to custody, either when remanded into custody on 21 August 2017 or when he was sentenced on <ins class="ministerial">25 January 2018</ins> <del class="ministerial">15 February 2018</del>. Mr McCann has now been charged with a number of very serious offences committed on or after 21 April this year. This has triggered a mandatory serious further offence (SFO) review, under the Probation SFO Review Procedures. The SFO review will consider in greater depth than has thus far been possible, including by interviewing relevant members of staff, the question of whether Mr McCann should have been recalled to custody when charged with and subsequently convicted of the burglary offence. Typically, an SFO review is completed within three months of an offender being charged with an SFO.</p><p> </p>","South Swindon","Robert Buckland","2019-05-17T13:45:21.527Z","2019-06-12T14:34:49.657Z","http://data.parliament.uk/resources/1125244/answer","Biography information for Sir Robert Buckland","http://data.parliament.uk/resources/1125244/answer","South Swindon","Robert Buckland","http://data.parliament.uk/resources/1125244/answer/previousversion/118711","Biography information for Sir Robert Buckland","54","Justice","Justice","2019-05-08","Joseph McCann","1","House of Commons","To ask the Secretary of State for Justice, on what date was his Department informed of the release from prison of Joseph McCann.","false","Biography information for Richard Burgon","Leeds East","Richard Burgon","252006"
"http://data.parliament.uk/resources/1125245","Ministry of Justice","false","2019-05-17","<p>Information on releases in error are published as part of the HM Prison and Probation Service Annual Digest. The latest publication can be found here: <a href="https://www.gov.uk/government/statistics/annual-hm-prison-and-probation-service-digest-2017-to-2018" target="_blank">https://www.gov.uk/government/statistics/annual-hm-prison-and-probation-service-digest-2017-to-2018</a></p><p> </p><p>Releases in error are rare and in the vast majority of cases offenders are returned to custody very quickly. We work closely with the police to recapture those at large and investigate each incident thoroughly to see what lessons can be learned.</p>","South Swindon","Robert Buckland","2019-05-17T12:03:21.407Z",,"http://data.parliament.uk/resources/1125245/answer","Biography information for Sir Robert Buckland","http://data.parliament.uk/resources/1125245/answer",,,,,"54","Justice","Justice","2019-05-08","Prisoners' Release","1","House of Commons","To ask the Secretary of State for Justice, what estimate he has made of the number of prisoners who have been released in error in each of the last three years.","false","Biography information for Richard Burgon","Leeds East","Richard Burgon","252007"
"http://data.parliament.uk/resources/1125247","Home Office","false","2019-05-16","<p>The number of enforced returns from the UK by year and country of nationality is published in table rt_02 (returns data tables, volume 1) in ‘Immigration Statistics, year ending December 2018’, available from the GOV.uk website at: <br><a href="https://www.gov.uk/government/uploads/system/uploads/attachment_data/file/781113/returns1-dec-2018-tables.ods" target="_blank">https://www.gov.uk/government/uploads/system/uploads/attachment_data/file/781113/returns1-dec-2018-tables.ods</a></p><p>The term 'deportations' refers to a legally-defined subset of returns which are enforced either following a criminal conviction or when it is judged that a person’s removal from the UK is conducive to the public good. Information on those deported is not separately available and therefore the published statistics refer to all enforced returns.</p><p>Information for January to March 2019 will be published on 24th May 2019.</p>","Romsey and Southampton North","Caroline Nokes","2019-05-16T15:08:41.763Z",,"http://data.parliament.uk/resources/1125247/answer","Biography information for Caroline Nokes","http://data.parliament.uk/resources/1125247/answer",,,,,"1","Home Office","Home Office","2019-05-08","Deportation: Sri Lanka","1","House of Commons","To ask the Secretary of State for the Home Department, how many people have been deported to Sri Lanka from the UK in (a) 2015, (b) 2016, (c) 2017, (d) 2018 and  (e) to date in 2019.","false","Biography information for Keith Vaz","Leicester East","Keith Vaz","251906"
