"uri","answering body","answer > is ministerial correction","answer > date of answer","answer > answer text","answer > answering member constituency","answer > answering member printed","answer > grouped question UIN","answer > question first answered","answer > uri","answer > answering member > label","answer > uri","answer > previous answer version > answering member constituency","answer > previous answer version > answering member printed","answer > previous answer version > uri","answer > previous answer version > answering member > label","answering dept id","answering dept short name","answering dept sort name","date","hansard heading","house id","legislature > pref label","question text","registered interest","tabling member > label","tabling member constituency","tabling member printed","uin"
"http://data.parliament.uk/resources/1150238","Women and Equalities","false","2019-10-17","<p><em>We are committed to improving accessibility at rail stations, and have recently extended the Access for All programme with £300m to provide accessibility improvements at even more stations. This is in addition to improvements required whenever infrastructure work is carried out at a station by the industry.</em></p>","Wealden","Ms Nusrat Ghani",,"2019-10-17T16:36:08.137Z","http://data.parliament.uk/resources/1150238/answer","Biography information for Ms Nusrat Ghani","http://data.parliament.uk/resources/1150238/answer",,,,,"31","Women and Equalities","Women and Equalities","2019-10-17","Railway Stations: Disability","1","House of Commons","What recent discussions she has had with the Secretary of State for Transport on rail stations that are inaccessible to people with disabilities; and if she will make a statement.","false","Biography information for Ruth George","High Peak","Ruth George","900033"
"http://data.parliament.uk/resources/1148850","Department for Work and Pensions","false","2019-10-17","<p>We are the biggest Government Department with a day to day operation on which around 22 million citizens depend. The Department has a responsibility to communicate policy and essential information to claimants and other key audiences.</p><p> </p><p>The Metro partnership was designed to increase understanding of Universal Credit and ensure people have the right factual information they need to make a claim and understand their potential entitlement.</p><p> </p><p>We went to great lengths to ensure the factual accuracy of the campaign through extensive consultation within the Department, including the Government Legal Department. We also consulted with the Advertising Standards Authority Copy Advice Team prior to the launch and continued to do so throughout the campaign lifetime.</p><p> </p><p>The letter of 31 July 2019 placed in the House of Commons Library disclosed the full cost of the Department’s partnership with Associated Newspapers. There were no advertising agencies, consultancy or additional costs associated with the campaign and detailed planning was taken forward by Departmental officials.</p><p> </p><p>We have already shared a copy of the memo of 2 May 2019 from the Director General of Universal Credit and Director of Communications to DWP staff with the Work and Pensions Select Committee but can also commit to placing a copy in the House of Commons Library.</p>","Colchester","Will Quince","322 ; 323","2019-10-17T13:34:22.127Z","http://data.parliament.uk/resources/1148850/answer","Biography information for Will Quince","http://data.parliament.uk/resources/1148850/answer",,,,,"29","Work and Pensions","Work and Pensions","2019-10-14","Department for Work and Pensions: Metro Newspaper","1","House of Commons","To ask the Secretary of State for Work and Pensions, with reference to the letter of 31 July 2019 from the Minister for Family Support, Housing and Child Maintenance placed in the Library disclosing the cost of the Department’s partnership with Associated Newspapers, if she will provide (a) costs of the advertising consultancy and (b) all other costs incurred in the Universal Credit Uncovered advertising campaign which ran in May and June 2019 in The Metro and online.","false","Biography information for Ruth George","High Peak","Ruth George","316"
"http://data.parliament.uk/resources/1148856","Department for Work and Pensions","false","2019-10-17","<p>We are the biggest Government Department with a day to day operation on which around 22 million citizens depend. The Department has a responsibility to communicate policy and essential information to claimants and other key audiences.</p><p> </p><p>The Metro partnership was designed to increase understanding of Universal Credit and ensure people have the right factual information they need to make a claim and understand their potential entitlement.</p><p> </p><p>We went to great lengths to ensure the factual accuracy of the campaign through extensive consultation within the Department, including the Government Legal Department. We also consulted with the Advertising Standards Authority Copy Advice Team prior to the launch and continued to do so throughout the campaign lifetime.</p><p> </p><p>The letter of 31 July 2019 placed in the House of Commons Library disclosed the full cost of the Department’s partnership with Associated Newspapers. There were no advertising agencies, consultancy or additional costs associated with the campaign and detailed planning was taken forward by Departmental officials.</p><p> </p><p>We have already shared a copy of the memo of 2 May 2019 from the Director General of Universal Credit and Director of Communications to DWP staff with the Work and Pensions Select Committee but can also commit to placing a copy in the House of Commons Library.</p>","Colchester","Will Quince","316 ; 323","2019-10-17T13:34:22.08Z","http://data.parliament.uk/resources/1148856/answer","Biography information for Will Quince","http://data.parliament.uk/resources/1148856/answer",,,,,"29","Work and Pensions","Work and Pensions","2019-10-14","Department for Work and Pensions: Daily Mail and Metro Newspaper","1","House of Commons","To ask the Secretary of State for Work and Pensions, whether the Government Legal Service approved the Universal Credit Uncovered advertising campaign in the Metro and the Mail Online in May and June 2019.","false","Biography information for Ruth George","High Peak","Ruth George","322"
"http://data.parliament.uk/resources/1148857","Department for Work and Pensions","false","2019-10-17","<p>We are the biggest Government Department with a day to day operation on which around 22 million citizens depend. The Department has a responsibility to communicate policy and essential information to claimants and other key audiences.</p><p> </p><p>The Metro partnership was designed to increase understanding of Universal Credit and ensure people have the right factual information they need to make a claim and understand their potential entitlement.</p><p> </p><p>We went to great lengths to ensure the factual accuracy of the campaign through extensive consultation within the Department, including the Government Legal Department. We also consulted with the Advertising Standards Authority Copy Advice Team prior to the launch and continued to do so throughout the campaign lifetime.</p><p> </p><p>The letter of 31 July 2019 placed in the House of Commons Library disclosed the full cost of the Department’s partnership with Associated Newspapers. There were no advertising agencies, consultancy or additional costs associated with the campaign and detailed planning was taken forward by Departmental officials.</p><p> </p><p>We have already shared a copy of the memo of 2 May 2019 from the Director General of Universal Credit and Director of Communications to DWP staff with the Work and Pensions Select Committee but can also commit to placing a copy in the House of Commons Library.</p>","Colchester","Will Quince","316 ; 322","2019-10-17T13:34:22.173Z","http://data.parliament.uk/resources/1148857/answer","Biography information for Will Quince","http://data.parliament.uk/resources/1148857/answer",,,,,"29","Work and Pensions","Work and Pensions","2019-10-14","Department for Work and Pensions: Daily Mail and Metro Newspaper","1","House of Commons","To ask the Secretary of State for Work and Pensions, if she will place in the Library a copy of the memo of 2 May 2019 sent by her Department’s Director General of Universal Credit and Director of Communications to DWP staff setting out the purpose of the Universal Credit Uncovered advertising campaign in the Metro and Mail Online.","false","Biography information for Ruth George","High Peak","Ruth George","323"
"http://data.parliament.uk/resources/1148858","Department of Health and Social Care","false","2019-10-17","<p>The United Kingdom Government has proposed to all Member States that we should maintain existing reciprocal healthcare arrangements until 31 December 2020 if the UK leaves the European Union without a deal. This includes the European Health Insurance Card (EHIC) which can support UK residents with long term conditions travelling to the EU who may require needs arising treatment.</p><p>The Government understands the concerns of patients with long term conditions and is working to secure the continuation of reciprocal healthcare arrangements, so UK and EU nationals have access to medical treatment in the same way they do now.</p><p>Guidance for travelling to the EU after EU exit is available on gov.uk, available at the following link:</p><p><a href="https://www.gov.uk/guidance/uk-residents-visiting-the-eueea-and-switzerland-healthcare" target="_blank">https://www.gov.uk/guidance/uk-residents-visiting-the-eueea-and-switzerland-healthcare</a></p><p>The UK Government is advising people with pre-existing or long term medical conditions to also check the Money and Pensions Advice Service which has information on their website for people about their options for purchasing travel insurance. Further information is available at the following link:</p><p><a href="http://www.moneyadviceservice.org.uk/en/articles/travel-insurance-for-over-65s-and-medical-conditions" target="_blank">www.moneyadviceservice.org.uk/en/articles/travel-insurance-for-over-65s-and-medical-conditions</a></p>","Charnwood","Edward Argar",,"2019-10-17T09:40:57.957Z","http://data.parliament.uk/resources/1148858/answer","Biography information for Edward Argar","http://data.parliament.uk/resources/1148858/answer",,,,,"17","Health and Social Care","Health and Social Care","2019-10-14","Health Services: Reciprocal Arrangements","1","House of Commons","To ask the Secretary of State for Health and Social Care, with reference to the Answer of 9 September 2019 to Question 284706, what advice the Government has issued to UK citizens travelling in the EU that require treatments not routinely covered by travel insurance policies after the UK leaves the EU.","false","Biography information for Ruth George","High Peak","Ruth George","324"
"http://data.parliament.uk/resources/1148860","Department of Health and Social Care","false","2019-10-17","<p>The Department is doing everything appropriate to prepare for leaving the European Union. We want to reassure patients that our plans should ensure the uninterrupted supply of medicines and medical products once we have left the EU.</p><p>The Department, as part of our EU exit preparations, continues to implement a multi-layered approach to mitigate potential disruption to supply, which includes medicines and consumables needed for dialysis or transplantation. This approach consists of stockpiling where possible, securing freight capacity, changing or clarifying regulatory requirements, procuring additional warehousing, working closely with industry to improve trader readiness and putting in place the National Supply Disruption Response to manage potential shortages. Further details can be found at the following link:</p><p><a href="https://www.gov.uk/government/news/medicines-and-medical-products-supply-government-updates-no-deal-brexit-plans" target="_blank">https://www.gov.uk/government/news/medicines-and-medical-products-supply-government-updates-no-deal-brexit-plans</a></p><p> </p>","Charnwood","Edward Argar",,"2019-10-17T09:44:50.61Z","http://data.parliament.uk/resources/1148860/answer","Biography information for Edward Argar","http://data.parliament.uk/resources/1148860/answer",,,,,"17","Health and Social Care","Health and Social Care","2019-10-14","NHS: Drugs","1","House of Commons","To ask the Secretary of State for Health and Social Care, what steps he is taking to ensure that there will be no shortage of the medicines and consumables needed for dialysis or transplantation following the UK’s departure from the EU.","false","Biography information for Ruth George","High Peak","Ruth George","325"
"http://data.parliament.uk/resources/1148861","Department of Health and Social Care","false","2019-10-22","<p>While Serious Shortage Protocols (SSP) in England have the scope to cover all medicines and appliances that are on a National Health Service prescription in primary care, including immunosuppressant medicines, it is clear that an SSP for therapeutic or generic equivalents will not necessarily be suitable for all medicines and patients. For example, where medicines need to be prescribed by brand for clinical reasons, which may be the case for certain immunosuppressant medicines. In these cases, patients would always be referred back to the prescriber for any decision about their treatment before any alternative is supplied.</p><p>Any protocol would however only be introduced if clinicians with expertise in the relevant area think it is appropriate. So, if an SSP for an immunosuppressant medicine was under consideration, this would be agreed with, for example, transplant specialists or other relevant clinicians. Pharmacists will have to use their professional judgment as to whether supplying against the protocol rather than the prescription is appropriate or the patient should be referred to their prescriber.</p><p> </p><p> </p>","Bury St Edmunds","Jo Churchill",,"2019-10-22T11:21:30.857Z","http://data.parliament.uk/resources/1148861/answer","Biography information for Jo Churchill","http://data.parliament.uk/resources/1148861/answer",,,,,"17","Health and Social Care","Health and Social Care","2019-10-14","NHS: Drugs","1","House of Commons","To ask the Secretary of State for Health and Social Care,  with reference to the Explanatory Memorandum to The Human Medicines (Amendment) Regulations 2019, 7.12, whether in the event of a Serious Shortage Protocol being issued for immunosuppressant medicines patients would always be referred back to the prescriber for any decision on their treatment before any therapeutic or generic alternative is supplied.","false","Biography information for Ruth George","High Peak","Ruth George","326"
"http://data.parliament.uk/resources/1146576","Department for Business, Energy and Industrial Strategy","false","2019-10-01","<p>The Department is consulting with UK Overseas Territories as to whether they would like to have the UK’s ratification of the Paris Agreement extended to them. For those UK Overseas Territories that so choose, the Department will work with them to ensure they are ready to implement the Paris Agreement and to regularly report to the Department on that implementation.</p><p> </p><p>Under the accounting and transparency rules for the Paris Agreement agreed at COP24 in December 2018, any UK Overseas Territories included in the geographic scope of UK’s ratification of the Paris Agreement in future will also need to be included in the UK’s accounting for and regular reporting on emissions under the UN Framework Convention on Climate Change.</p><p> </p><p>The UK was the first major economy in the world to legislate for a net zero target. The target is enshrined under the Climate Change Act 2008 which does not apply to UK Overseas Territories.</p>","Spelthorne","Kwasi Kwarteng","291443","2019-10-01T15:12:15.79Z","http://data.parliament.uk/resources/1146576/answer","Biography information for Kwasi Kwarteng","http://data.parliament.uk/resources/1146576/answer",,,,,"201","Business, Energy and Industrial Strategy","Business, Energy and Industrial Strategy","2019-09-26","Carbon Emissions: British Overseas Territories ","1","House of Commons","To ask the Secretary of State for Business, Energy and Industrial Strategy, whether her Department plans to include carbon emissions from UK Overseas Territories in its carbon accounting processes for the Paris Agreement.","false","Biography information for Ruth George","High Peak","Ruth George","291441"
"http://data.parliament.uk/resources/1146578","Department for Business, Energy and Industrial Strategy","false","2019-10-01","<p>The Department is consulting with UK Overseas Territories as to whether they would like to have the UK’s ratification of the Paris Agreement extended to them. For those UK Overseas Territories that so choose, the Department will work with them to ensure they are ready to implement the Paris Agreement and to regularly report to the Department on that implementation.</p><p> </p><p>Under the accounting and transparency rules for the Paris Agreement agreed at COP24 in December 2018, any UK Overseas Territories included in the geographic scope of UK’s ratification of the Paris Agreement in future will also need to be included in the UK’s accounting for and regular reporting on emissions under the UN Framework Convention on Climate Change.</p><p> </p><p>The UK was the first major economy in the world to legislate for a net zero target. The target is enshrined under the Climate Change Act 2008 which does not apply to UK Overseas Territories.</p>","Spelthorne","Kwasi Kwarteng","291441","2019-10-01T15:12:15.83Z","http://data.parliament.uk/resources/1146578/answer","Biography information for Kwasi Kwarteng","http://data.parliament.uk/resources/1146578/answer",,,,,"201","Business, Energy and Industrial Strategy","Business, Energy and Industrial Strategy","2019-09-26","Carbon Emissions: British Overseas Territories","1","House of Commons","To ask the Secretary of State for Business, Energy and Industrial Strategy, if her Department will work with the UK Overseas Territories to reduce their carbon emissions as part of the UK’s (a) contribution towards the Paris Agreement and (b) Net Zero commitment.","false","Biography information for Ruth George","High Peak","Ruth George","291443"
"http://data.parliament.uk/resources/1145855","Department for Work and Pensions","false","2019-10-01","<p>The Department has raised awareness of Universal Credit advance fraud via Jobcentreplus and a dedicated social media campaign, which reminds people of the importance of safeguarding their identity. The Department has also worked with social media sites to shut down pages that promote this type of fraud, with 125 pages closed to date.</p><p> </p><p>The Department remains committed to keeping all Universal Credit services and processes, including advance payments, under review, and are making improvements to address any vulnerability in the system.</p><p> </p><p>The Department now requires customers not only to prove their identity, but also attend a face to face interview at the Jobcentre before they can claim an advance. The Department remains on track with design and test activity to further reduce the risk of opportunistic advances fraud by using real time validation of key elements of the application.</p><p> </p><p>In each instance we are taking care to ensure that there is no adverse effect on our ability to provide advance payments to those who need them.</p>","Hexham","Guy Opperman",,"2019-10-01T15:33:01.967Z","http://data.parliament.uk/resources/1145855/answer","Biography information for Guy Opperman","http://data.parliament.uk/resources/1145855/answer","Hexham","Guy Opperman","http://data.parliament.uk/resources/1145855/answer/previousversion/136339","Biography information for Guy Opperman","29","Work and Pensions","Work and Pensions","2019-09-25","Universal Credit: Fraud","1","House of Commons","To ask the Secretary of State for Work and Pensions, what steps her Department has taken to prevent third-party universal credit fraud.","false","Biography information for Ruth George","High Peak","Ruth George","291055"
