"uri","answering body","answer > is ministerial correction","answer > date of answer","answer > answer text","answer > answering member constituency","answer > answering member printed","answer > grouped question UIN","answer > question first answered","answer > uri","answer > answering member > label","answer > uri","answer > attachment > file name","answer > attachment > title","answering dept id","answering dept short name","answering dept sort name","date","hansard heading","house id","legislature > pref label","question text","registered interest","tabling member > label","tabling member constituency","tabling member printed","uin"
"http://data.parliament.uk/resources/1137585","Department for Transport","false","2019-07-11","<p>The Government has been clear that it does not intend to rely on ECMT permits after we leave the EU. The EU has agreed a regulation on basic road connectivity which guarantees rights for UK hauliers to continue providing services between the UK and the EU should the UK leave without a deal. As it stands, the Regulation would come into effect if the UK left the EU without a deal and would last until 31 December 2019.</p><p>Going forward, we will be working with Member States to agree on bilateral arrangements. Many old bilateral agreements would become reinstated if we leave without a deal and we are confident that other bilaterals will be agreed swiftly, given it is in the interest of both sides for freight to continue to flow.</p><p>The UK’s allocation of ECMT permits for 2020 is a base quota of 174 which is equivalent to 2,088 annual Euro VI ECMT permits.</p>","Epsom and Ewell","Chris Grayling",,"2019-07-11T14:53:52.163Z","http://data.parliament.uk/resources/1137585/answer","Biography information for Chris Grayling","http://data.parliament.uk/resources/1137585/answer",,,"27","Transport","Transport","2019-07-11","Large Goods Vehicles: EU Countries","1","House of Commons","To ask the Secretary of State for Transport, what estimate he has made of the number of ECMT permits (a) required by UK haulier operations and (b) that will be made available in the event that the UK leaves the EU without a deal.","false","Biography information for Neil O'Brien","Harborough","Neil O'Brien","274651"
"http://data.parliament.uk/resources/1138411","Treasury","false","2019-07-19","<p>In December 2018, there were 431,553 active UK Economic Operator Registration and Identification (EORI) numbers. Since December 2018, HM Revenue &amp; Customs have issued approximately 74,000 new UK EORI numbers, up to 23 June.</p>","Hereford and South Herefordshire","Jesse Norman",,"2019-07-19T12:53:27.283Z","http://data.parliament.uk/resources/1138411/answer","Biography information for Jesse Norman","http://data.parliament.uk/resources/1138411/answer",,,"14","Treasury","Treasury","2019-07-11","Business: Registration","1","House of Commons","To ask the Chancellor of the Exchequer, how many Economic Operator Registration and Identification numbers were held by UK firms in (a) December 2018 and (b) 23 June 2019.","false","Biography information for Neil O'Brien","Harborough","Neil O'Brien","276289"
"http://data.parliament.uk/resources/1138048","Department for Environment, Food and Rural Affairs","false","2019-07-22","<p>If the UK leaves the EU without a deal we expect the number of Export Health Certificates (EHCs) issued for exports to increase.</p><p>To address this increase, we have offered free training to official veterinarians, with around 1000 official veterinarians now able to sign EHCs.</p><p>We have created a new Certification Support Officer. This role will assist Certifying Officers to collate the evidence needed for certification. 250 have registered and 90 have qualified in Great Britain so far.</p><p>We have offered local authorities funding to help them meet demand for EHCs, and a new web portal for processing EHCs will also help by speeding up the application process.</p><p>The proposed risk based approach to inspecting EHCs will increase the capacity for local authority Certifying Officers to certify export health certificates for fish and fish products.</p>","Macclesfield","David Rutley",,"2019-07-22T13:08:28.43Z","http://data.parliament.uk/resources/1138048/answer","Biography information for David Rutley","http://data.parliament.uk/resources/1138048/answer",,,"13","Environment, Food and Rural Affairs","Environment, Food and Rural Affairs","2019-07-10","Export Health Certificates","1","House of Commons","To ask the Secretary of State for Environment, Food and Rural Affairs, what assessment he has made of the potential increase in the number of Export Health Certificate that will be required in the event of the UK leaving the EU without a deal.","false","Biography information for Neil O'Brien","Harborough","Neil O'Brien","275832"
"http://data.parliament.uk/resources/1138054","Ministry of Justice","false","2019-07-31","<p>The number of people who have previously received (a) 25 or more and (b) 50 or more convictions or cautions, have been convicted of an offence and not been given a custodial sentence in each year since 2007; and the number of those people have previously been convicted of (i) possession of a blade or point, (ii) possession of an offensive weapon, (iii) common assault, (iv) assaulting a police officer, (v) sexual assault, (vi) public order, (vii) theft, (viii) robbery, (ix) burglary, (x) drugs, (xi) criminal damage, (xii) breach of anti social behaviour order, (xiii) fraud and (xiv) vehicle taking can be viewed in the table.</p>","South East Cambridgeshire","Lucy Frazer",,"2019-07-31T16:09:08.033Z","http://data.parliament.uk/resources/1138054/answer","Biography information for Lucy Frazer","http://data.parliament.uk/resources/1138054/answer","Table for PQ 275833.xlsx","Table","54","Justice","Justice","2019-07-10","Crime: Convictions","1","House of Commons","To ask the Secretary of State for Justice, how many people who have previously received (a) 25 or more and (b) 50 or more convictions or cautions, have been convicted of an offence and not been given a custodial sentence in each year since 2007; and how many of those people have previously been convicted of (i) possession of a blade or point, (ii) possession of an offensive weapon, (iii) common assault, (iv) assaulting a police officer, (v) sexual assault, (vi) public order, (vii) theft, (viii) robbery, (ix) burglary, (x) drugs, (xi) criminal damage, (xii) breach of anti social behaviour order, (xiii) fraud and (xiv) vehicle taking.","false","Biography information for Neil O'Brien","Harborough","Neil O'Brien","275833"
"http://data.parliament.uk/resources/1138055","Ministry of Justice","false","2019-07-31","<p>The information requested is provided in the tables attached with this answer. These tables include data, covering the period 2007 – 2018, on:</p><ul><li>The number of offenders with a specified number of previous convictions and cautions for any offence, who were sentenced to immediate custody for the first time for a specified offence.</li><li>The average number of previous convictions for any offence, and the average number of previous cautions for any offence, for offenders who were sentenced to immediate custody for the first time for a specified offence.</li></ul><p> </p><p>This data is not regularly published or held in an easily accessible format. The information supplied has been sourced from a number of complicated retrievals from the Police National Computer database.</p>","South East Cambridgeshire","Lucy Frazer","275835","2019-07-31T16:13:40.187Z","http://data.parliament.uk/resources/1138055/answer","Biography information for Lucy Frazer","http://data.parliament.uk/resources/1138055/answer","PQs 275834 and 275835 Response Table.xlsx","Table","54","Justice","Justice","2019-07-10","Prison Sentences","1","House of Commons","To ask the Secretary of State for Justice, how many people sentenced to an immediate custodial sentence for the first time for (a) possession of a blade or point, (b) possession of an offensive weapon, (c) common assault, (d) assaulting a police officer, (e) sexual assault, (f) public order, (g) theft, (h) robbery, (i) burglary, (j) drugs, (k) criminal damage, (l) breach of and anti-social behaviour order, (m) fraud and (n) vehicle taking had (i) no, (ii) between one and four, (iii) between five and nine, (iv) between 10 and 15, (v) between 16 and 25, (vi) between 26 and 50, (vii) between 51 and 75, (viii) between 76 and 100 and (ix) 101 or more convictions and cautions for previous offences of any type in each year since 2007.","false","Biography information for Neil O'Brien","Harborough","Neil O'Brien","275834"
"http://data.parliament.uk/resources/1138056","Ministry of Justice","false","2019-07-31","<p>The information requested is provided in the tables attached with this answer. These tables include data, covering the period 2007 – 2018, on:</p><ul><li>The number of offenders with a specified number of previous convictions and cautions for any offence, who were sentenced to immediate custody for the first time for a specified offence.</li><li>The average number of previous convictions for any offence, and the average number of previous cautions for any offence, for offenders who were sentenced to immediate custody for the first time for a specified offence.</li></ul><p> </p><p>This data is not regularly published or held in an easily accessible format. The information supplied has been sourced from a number of complicated retrievals from the Police National Computer database.</p>","South East Cambridgeshire","Lucy Frazer","275834","2019-07-31T16:13:40.237Z","http://data.parliament.uk/resources/1138056/answer","Biography information for Lucy Frazer","http://data.parliament.uk/resources/1138056/answer","PQs 275834 and 275835 Response Table.xlsx","Table","54","Justice","Justice","2019-07-10","Prison Sentences","1","House of Commons","To ask the Secretary of State for Justice, what the average number of previous (a) cautions and (b) convictions offenders had before being sentenced to an immediate custodial sentence for the first time for (i) possession of a blade or point, (ii) possession of an offensive weapon, (iii) common assault, (iv) assaulting a police officer, (v) sexual assault, (vi) public order, (vii) theft, (viii) robbery, (ix) burglary, (x) drugs, (xi) criminal damage, (xii) breach of anti social behaviour order, (xiii) fraud and (xiv) vehicle taking in each year since 2007.","false","Biography information for Neil O'Brien","Harborough","Neil O'Brien","275835"
"http://data.parliament.uk/resources/1138057","Ministry of Justice","false","2019-07-31","<p>The largest number of community sentences previously received by an offender who was (a) convicted of a crime and (b) convicted of a crime and sentenced to a community sentence in each year since 2007 can be viewed in the table.</p>","South East Cambridgeshire","Lucy Frazer",,"2019-07-31T16:22:38.26Z","http://data.parliament.uk/resources/1138057/answer","Biography information for Lucy Frazer","http://data.parliament.uk/resources/1138057/answer","PQ 275836 Table.xlsx","Table","54","Justice","Justice","2019-07-10","Alternatives to Prison","1","House of Commons","To ask the Secretary of State for Justice, what was the largest number of community sentences previously received by an offender who was (a) convicted of a crime and (b) convicted of a crime and sentenced to a community sentence in each year since 2007.","false","Biography information for Neil O'Brien","Harborough","Neil O'Brien","275836"
"http://data.parliament.uk/resources/1138058","Ministry of Justice","false","2019-07-31","<p>This data is not regularly published or held in an easily accessible format. The information supplied in the table attached has been sourced from several complicated retrievals from the Police National Computer database.</p>","South East Cambridgeshire","Lucy Frazer",,"2019-07-31T16:27:04.423Z","http://data.parliament.uk/resources/1138058/answer","Biography information for Lucy Frazer","http://data.parliament.uk/resources/1138058/answer","Table for PQ 275837.xlsx","Table","54","Justice","Justice","2019-07-10","Burglary: Sentencing","1","House of Commons","To ask the Secretary of State for Justice, what proportion of people sentenced for domestic burglary for (a) the third time and (b) more than three times received an immediate custodial sentence of (i) less than three years, (ii) exactly three years and (iii) more than three years in each year since 2007.","false","Biography information for Neil O'Brien","Harborough","Neil O'Brien","275837"
"http://data.parliament.uk/resources/1137666","Ministry of Justice","false","2019-07-09","<p>We are looking to take forward reform of short custodial sentences. We know that offenders serving short sentences often have long offending histories, as well as multiple and complex needs. In cases of the most persistent offenders, the evidence shows they are 36% more likely to re-offend where they have received a short custodial sentence rather than a court order. Community penalties can address underlying behaviour, answer mental health and alcohol or drug misuse needs and provide reparation for the benefit of the wider community.</p>","South Swindon","Robert Buckland",,"2019-07-09T16:03:15.583Z","http://data.parliament.uk/resources/1137666/answer","Biography information for Sir Robert Buckland","http://data.parliament.uk/resources/1137666/answer",,,"54","Justice","Justice","2019-07-09","Reoffenders: Sentencing","1","House of Commons","If he will review sentencing policy for prolific offenders.","false","Biography information for Neil O'Brien","Harborough","Neil O'Brien","911814"
"http://data.parliament.uk/resources/1137766","Ministry of Justice","false","2019-07-31","<p>The number of people convicted of an assault of a police officer, in each year since 2007, with more than 26 convictions, and the number of people who received a non-custodial or custodial sentence, and the average length of custodial sentences, can be found in the tables 1 and 2.</p>","South East Cambridgeshire","Lucy Frazer",,"2019-07-31T16:29:02.837Z","http://data.parliament.uk/resources/1137766/answer","Biography information for Lucy Frazer","http://data.parliament.uk/resources/1137766/answer","Copy of PQ 275247 Tables.xlsx","Table","54","Justice","Justice","2019-07-09","Assaults on Police: Convictions","1","House of Commons","To ask the Secretary of State for Justice, how many people were convicted of assault of a police officer in each year since 2007 who had (a) 26 to 50, (b) 51 to 75, (c) 76 to 100 and (d) over 100 previous convictions or cautions; how many people in each of those categories received a (i) custodial and (ii) non custodial sentence, and what the average length of custodial sentence was.","false","Biography information for Neil O'Brien","Harborough","Neil O'Brien","275247"
