"uri","answering body","answer > is ministerial correction","answer > date of answer","answer > answer text","answer > answering member constituency","answer > answering member printed","answer > question first answered","answer > uri","answer > answering member > label","answer > uri","answer > previous answer version > answering member constituency","answer > previous answer version > answering member printed","answer > previous answer version > uri","answer > previous answer version > answering member > label","answering dept id","answering dept short name","answering dept sort name","date","hansard heading","house id","legislature > pref label","question text","registered interest","tabling member > label","tabling member constituency","tabling member printed","uin"
"http://data.parliament.uk/resources/99775","Department for Business, Innovation and Skills","false","2014-10-23","<p>The Transatlantic Trade and Investment Partnership (TTIP) will not change the fact that it is up to UK Government alone to decide how UK public services, including the NHS, are run. The UK has insisted on maintaining the same safeguards for the NHS in TTIP as it has in all recent trade agreements.</p><p> </p><p> </p><p> </p><p>This position was confirmed by the European Commission</p><p> </p>","West Suffolk","Matthew Hancock","2014-10-23T17:00:03.036636Z","http://data.parliament.uk/resources/99775/answer","Biography information for Matt Hancock","http://data.parliament.uk/resources/99775/answer","West Suffolk","Matthew Hancock","http://data.parliament.uk/resources/99775/answer/previousversion/24061","Biography information for Matt Hancock","26","Business, Innovation and Skills","Business, Innovation and Skills","2014-10-20","NHS: Transatlantic Trade and Investment Partnership","1","House of Commons","To ask the Secretary of State for Business, Innovation and Skills, what assessment his Department has made of the potential effect of including the National Health Service in the negative list of exclusion for negotiations on the Transatlantic Trade and Investment partnership.","false","Biography information for Ian Murray","Edinburgh South","Ian Murray","211053"
"http://data.parliament.uk/resources/99777","Department for Business, Innovation and Skills","false","2014-10-24","<p>The UK aims to operate one of the most rigorous and transparent export control systems in the world. All export licence applications are rigorously assessed on a case-by-case basis against the Consolidated EU and National Arms Export Licensing Criteria, taking into account all prevailing circumstances at the time of application. In particular, Criterion Two concerns the ‘respect for human rights and fundamental freedoms in the country of final destination as well as respect by that country for international humanitarian law’. The Government will not issue an export licence if there is a clear risk that the proposed export might be used for internal repression.</p><p> </p><p> </p><p> </p><p>Export licences are kept under review in the light of changing international circumstances. A cross-government mechanism can suspend or revoke extant licences when a changing situation, such as an outbreak of conflict or acts of internal repression, means the licence would no longer be consistent with the Consolidated Criteria.</p><p> </p><p> </p><p> </p><p> </p><p> </p>","West Suffolk","Matthew Hancock","2014-10-24T06:57:14.0503748Z","http://data.parliament.uk/resources/99777/answer","Biography information for Matt Hancock","http://data.parliament.uk/resources/99777/answer","West Suffolk","Matthew Hancock","http://data.parliament.uk/resources/99777/answer/previousversion/24060","Biography information for Matt Hancock","26","Business, Innovation and Skills","Business, Innovation and Skills","2014-10-20","Arms Trade: Exports","1","House of Commons","To ask the Secretary of State for Business, Innovation and Skills, what his Department's policy is on reviewing export licences to a country where defence equipment supplied by UK firms has previously been used for internal repression.","false","Biography information for Mr Roger Godsiff","Birmingham, Hall Green","Mr Roger Godsiff","211054"
"http://data.parliament.uk/resources/99805","Department for Business, Innovation and Skills","false","2014-10-23","<p>Apprenticeship reforms are putting employers in the lead of designing apprenticeships, making it more attractive for them to offer more in the future.</p><p> </p><p> </p><p> </p><p>Across this parliament we have already supported over 500,000 new apprenticeships for 16-18 year olds. Building on the success of the Apprenticeship Grant for Employers, we are providing an additional £170 million to fund over 100,000 incentive payments of £1,500 to employers taking on a young person aged 16-24.</p><p> </p>","Grantham and Stamford","Nick Boles","2014-10-23T15:58:54.1437371Z","http://data.parliament.uk/resources/99805/answer","Biography information for Nick Boles","http://data.parliament.uk/resources/99805/answer",,,,,"26","Business, Innovation and Skills","Business, Innovation and Skills","2014-10-20","Apprentices: Young People","1","House of Commons","To ask the Secretary of State for Business, Innovation and Skills, what steps he is taking to persuade more businesses to offer apprenticeships to 16 to 18 year olds.","false","Biography information for Mr Adrian Bailey","West Bromwich West","Mr Adrian Bailey","211057"
"http://data.parliament.uk/resources/99708","Department for Business, Innovation and Skills","false","2014-10-22","<p>Progression data for Traineeships is planned for publication, subject to data quality, in a Statistical First Release. When available, it will be accessible at: <a href="https://www.gov.uk/government/statistics/learner-participation-outcomes-and-level-of-highest-qualification-held" target="_blank">https://www.gov.uk/government/statistics/learner-participation-outcomes-and-level-of-highest-qualification-held</a>.</p><p> </p>","Grantham and Stamford","Nick Boles","2014-10-22T15:25:52.8709794Z","http://data.parliament.uk/resources/99708/answer","Biography information for Nick Boles","http://data.parliament.uk/resources/99708/answer",,,,,"26","Business, Innovation and Skills","Business, Innovation and Skills","2014-10-17","Apprentices","1","House of Commons","To ask the Secretary of State for Business, Innovation and Skills, how many people who accessed a traineeship in the last 12 months have progressed to an accredited apprenticeship.","false","Biography information for Sir Stephen Timms","East Ham","Stephen Timms","211004"
"http://data.parliament.uk/resources/93764","Department for Business, Innovation and Skills","false","2014-10-23","<p>The Government is committed to protecting the privacy and data security rights of individuals, and does recognise that the potential exists for online personal information and data to be misused by organisations and agencies, including for discriminatory purposes. For this reason, stringent safeguards are in place to ensure personal data is protected and handled appropriately.</p><p> </p><p> </p><p> </p><p>The Data Protection Act 1998 and Article 8 of the European Convention on Human Rights impose clear legal limits on how organisations can record, store, alter, use or disclose personal data. In addition the Information Commissioners Office, the UK’s independent authority for upholding information rights, provides advice to citizens, rulings on eligible complaints and can take action when the law on data privacy is broken.</p><p> </p><p> </p><p> </p><p>The Government is also currently working with the Information Economy Council, business groups, regulators, the third sector, and consumer bodies to develop a framework of trust and privacy principles for businesses. The framework will be in addition to existing data protection legislation and is being developed to help create greater public confidence in how companies use and re-use their personal data.</p><p> </p><p> </p><p> </p>","Wantage","Mr Edward Vaizey","2014-10-23T16:00:16.2195587Z","http://data.parliament.uk/resources/93764/answer","Biography information for Lord Vaizey of Didcot","http://data.parliament.uk/resources/93764/answer",,,,,"26","Business, Innovation and Skills","Business, Innovation and Skills","2014-10-16","Internet: Data Protection","1","House of Commons","To ask the Secretary of State for Business, Innovation and Skills, what assessment he has made of the potential for online personal information and big data to be used for discriminatory practices by organisations and agencies.","false","Biography information for Mr Nicholas Brown","Newcastle upon Tyne East","Mr Nicholas Brown","210878"
"http://data.parliament.uk/resources/93091","Department for Business, Innovation and Skills","false","2014-10-17","<p>The new Employment Tribunal rules of procedure, which implemented the recommendations of the Underhill Review, were implemented on 29 July 2013. These rules allow tribunals to identify weak or vexatious claims at an early stage through an initial sift and to manage them effectively through measures such as deposit orders. Greater flexibility to apply a deposit order to parts of a claim or response helps to manage the expectations of claimants as to the strength of their claim and encourage them to consider more carefully what parts of their claim they want to take forward.</p><p> </p>","East Dunbartonshire","Jo Swinson","2014-10-17T13:29:29.1844112Z","http://data.parliament.uk/resources/93091/answer","Biography information for Jo Swinson","http://data.parliament.uk/resources/93091/answer",,,,,"26","Business, Innovation and Skills","Business, Innovation and Skills","2014-10-14","Small Businesses: Civil Proceedings","1","House of Commons","To ask the Secretary of State for Business, Innovation and Skills, what steps he is taking to protect small businesses from vexatious claims by employees; and if he will make a statement.","false","Biography information for Mr Laurence Robertson","Tewkesbury","Mr Laurence Robertson","210557"
"http://data.parliament.uk/resources/92787","Department for Business, Innovation and Skills","false","2014-10-23","<p>Government has been supporting Lord Davies’ voluntary business-led strategy for the advancement of all women, irrespective of ethnicity or disability. These measures are working. Women now account for 22.8% of board members in FTSE100 companies, up from 12.5% in February 2011.And there are no all-male boards in the FTSE 100 down from 21 in 2011.</p><p> </p><p> </p><p> </p><p>We do not collect statistics for, and FTSE 100 companies do not have to report on, the number of disabled or ethnic minorities on their boards.</p><p> </p><p> </p><p> </p><p>In September 2014 The Financial Reporting Council published an updated UK Corporate Governance Code, including changes to the preface highlighting the importance of diversity on the board. This includes gender, race and a wide range of other factors including difference of approach and experience.</p><p> </p><p>On 30 September the Secretary fo Business Innovation and Skills also announced his support for a business led initiative to support wider ethnic diversity on boards.</p><p> </p>",,"Baroness Neville-Rolfe","2014-10-23T16:37:38.7268947Z","http://data.parliament.uk/resources/92787/answer","Biography information for Baroness Neville-Rolfe","http://data.parliament.uk/resources/92787/answer",,,,,"26","Business, Innovation and Skills","Business, Innovation and Skills","2014-10-13","Directors: Equality","2","House of Lords","To ask Her Majesty’s Government what progress has been made with achieving diversity on corporate boards; and what percentages of (1) women, (2) disabled people, and (3) black and minority ethnic people there are on the boards of FTSE 100 companies.","false","Biography information for Lord Ouseley",,"Lord Ouseley","HL2023"
"http://data.parliament.uk/resources/92988","Department for Business, Innovation and Skills","false","2014-10-22","<p>Small businesses are the lifeblood of our economy and our small business owners have driven this economic recovery. Stafford has benefitted from a number of support schemes. The Start-Up Loan Scheme has provided business advice and 16 loans with a value of almost £60,000 to people starting a business. Since May 2010, 7 companies have benefitted from the Government’s Enterprise Finance Guarantee Scheme with a drawn down value of over £1 million.</p><p> </p><p> </p><p> </p><p>We are committed to making Britain the best place in the world to start and grow a business, and are doing this in a number of ways:</p><p> </p><ul><li>£10 billion of financing will be unlocked for smaller business over the next 5 years by our British Business Bank;</li><li>Government grants of up to £3000 for better internet connectivity are available to small businesses;<br> <br></li><li>The Business Support Helpline is available to provide bespoke information and advice;</li><li>Cuts to corporation tax from 28% to 21%; and</li><li>£2,000 cut from the National Insurance bills of small firms from the new Employment Allowance.</li></ul><p> </p><p> </p><p> </p><p> </p><p> </p><p> </p><p> </p><p> </p><p> </p>","West Suffolk","Matthew Hancock","2014-10-22T15:43:03.5916204Z","http://data.parliament.uk/resources/92988/answer","Biography information for Matt Hancock","http://data.parliament.uk/resources/92988/answer",,,,,"26","Business, Innovation and Skills","Business, Innovation and Skills","2014-10-13","Small Businesses: Stafford","1","House of Commons","To ask the Secretary of State for Business, Innovation and Skills, what steps his Department is taking to support small and medium-sized businesses in Stafford constituency.","false","Biography information for Jeremy Lefroy","Stafford","Jeremy Lefroy","210227"
"http://data.parliament.uk/resources/92109","Department for Business, Innovation and Skills","false","2014-10-14","<p>A team led by Professor Joseph Francois, organised by the Centre for Economic Policy and Research (CEPR), carried out the analysis. The following project requirements are taken from the terms of tender document. The project was costed at £72,600 excluding VAT.</p>","West Suffolk","Matthew Hancock","2014-10-14T16:47:13.6908316Z","http://data.parliament.uk/resources/92109/answer","Biography information for Matt Hancock","http://data.parliament.uk/resources/92109/answer",,,,,"26","Business, Innovation and Skills","Business, Innovation and Skills","2014-09-26","Transatlantic Trade and Investment Partnership","1","House of Commons","To ask the Secretary of State for Business, Innovation and Skills, pursuant to the Answer of 11 September 2014, Official Report, column 730W, on the Transatlantic Trade and Investment Partnership, who carried out the independent analysis; what their terms of reference were; and what the cost of that analysis was.","false","Biography information for Greg Mulholland","Leeds North West","Greg Mulholland","209676"
