"uri","answering body","answer > is ministerial correction","answer > date of answer","answer > answer text","answer > answering member constituency","answer > answering member printed","answer > question first answered","answer > question first ministerially corrected","answer > uri","answer > answering member > label","answer > uri","answer > attachment > file name","answer > attachment > title","answer > uri","answer > previous answer version > answering member constituency","answer > previous answer version > answering member printed","answer > previous answer version > uri","answer > previous answer version > answering member > label","answer > previous answer version > uri","answer > previous answer version > attachment > file name","answer > previous answer version > attachment > title","answering dept id","answering dept short name","answering dept sort name","date","hansard heading","house id","legislature > pref label","question text","registered interest","tabling member > label","tabling member constituency","tabling member printed","uin"
"http://data.parliament.uk/resources/416723","Home Office","true","2015-09-18","<p>The Disclosure and Barring Service (DBS) provides the Home Office with monthly updates on performance. Latest figures (relating to July 2015) show that the average processing time for disclosure applications was 14.3 days. The DBS operates to a target to issue 95% of disclosure certificates within 56 days (8 weeks) and in July 95.2% were issued within this time.</p><p>DBS funding for police disclosure units in 2013-14 and 2014-15 is set out in the <del class="ministerial">attached table.</del> <ins class="ministerial">attached table.</ins> Decisions on the operational deployment of resources, including vacancy filling, are matters for Chief Constables in association with Police and Crime Commissioners.</p><p>The DBS is working closely with the Metropolitan Police Service (MPS) to help reduce the time taken to process disclosure checks for all applicants including taxi drivers in London. The MPS has established a Gold Group, which includes DBS representation, to develop and implement a plan to improve MPS disclosure turnaround times.</p><p> </p>","Staffordshire Moorlands","Karen Bradley","2015-09-18T10:39:08.017Z","2015-09-21T11:00:28.303Z","http://data.parliament.uk/resources/416723/answer","Biography information for Dame Karen Bradley","http://data.parliament.uk/resources/416723/answer","PQ 8918 DBS funding to police forces 2013-14 20 14-15 07 09 15 (1).xlsx","DBS Table","http://data.parliament.uk/resources/416723/answer","Staffordshire Moorlands","Karen Bradley","http://data.parliament.uk/resources/416723/answer/previousversion/22168","Biography information for Dame Karen Bradley","http://data.parliament.uk/resources/416723/answer/previousversion/22168",,,"1","Home Office","Home Office","2015-09-04","Disclosure and Barring Service: Standards","1","House of Commons","To ask the Secretary of State for the Home Department, what recent assessment she has made of the performance of the Disclosure and Barring Service.","false","Biography information for Steve Reed","Croydon North","Mr Steve Reed","8920"
"http://data.parliament.uk/resources/388300","Home Office","true","2015-07-15","<p>A total of 49,173 international child passport applications finished processing in January-June 2015. Of this total, <del class="ministerial">2,418 (4.9%)</del> <ins class="ministerial">3,242 (6.6%)</ins> took longer than three months to be processed, <del class="ministerial">1,780 (3.6%)</del> <ins class="ministerial">2,539 (5.2%)</ins> took longer than four months to be processed, and <del class="ministerial">944 (1.9%)</del> <ins class="ministerial">1,657 (3.4%)</ins> took longer than six months to be processed.</p><p>The processing time is the length of time from receipt of the application to the passport being printed. For international child passport applications processed in the same period, the average processing time was 19.4 working days. Information is not held on the time between receipt of application and interview date as the date of interview can be subject to customer availability.</p><p>Her Majesty’s Passport Office must be fully satisfied that all appropriate checks have been completed successfully prior to the issuance of passport facilities. This is particularly important in relation to child applications as part of Her Majesty’s Passport Office responsibility to protect potentially vulnerable children, including those potentially at risk of child trafficking and to maintain the integrity of the British Passport.</p><p>These checks can require the provision of information from other agencies overseas – particularly in complex applications such as surrogacy cases.</p><p>Delays in the provision of this information to HMPO can lead to significantly extended timeframe in processing applications.</p><p> </p><p> </p>","Old Bexley and Sidcup","James Brokenshire","2015-07-15T15:19:26.56Z","2015-08-05T13:22:11.11Z","http://data.parliament.uk/resources/388300/answer","Biography information for James Brokenshire","http://data.parliament.uk/resources/388300/answer",,,"http://data.parliament.uk/resources/388300/answer","Old Bexley and Sidcup","James Brokenshire","http://data.parliament.uk/resources/388300/answer/previousversion/14230","Biography information for James Brokenshire","http://data.parliament.uk/resources/388300/answer/previousversion/14230",,,"1","Home Office","Home Office","2015-07-07","Passports: British Nationals Abroad","1","House of Commons","To ask the Secretary of State for the Home Department, what (a) number and (b) proportion of applications for a passport for a child overseas take longer than (a) three, (b) four and (c) six months to be processed.","false","Biography information for Tommy Sheppard","Edinburgh East","Tommy Sheppard","5846"
"http://data.parliament.uk/resources/388302","Home Office","true","2015-07-15","<p>A total of 49,173 international child passport applications finished processing in January-June 2015. Of this total, <del class="ministerial">2,418 (4.9%)</del> <ins class="ministerial">3,242 (6.6%)</ins> took longer than three months to be processed, <del class="ministerial">1,780 (3.6%)</del> <ins class="ministerial">2,539 (5.2%)</ins> took longer than four months to be processed, and <del class="ministerial">944 (1.9%)</del> <ins class="ministerial">1,657 (3.4%)</ins> took longer than six months to be processed.</p><p>The processing time is the length of time from receipt of the application to the passport being printed. For international child passport applications processed in the same period, the average processing time was 19.4 working days. Information is not held on the time between receipt of application and interview date as the date of interview can be subject to customer availability.</p><p>Her Majesty’s Passport Office must be fully satisfied that all appropriate checks have been completed successfully prior to the issuance of passport facilities. This is particularly important in relation to child applications as part of Her Majesty’s Passport Office responsibility to protect potentially vulnerable children, including those potentially at risk of child trafficking and to maintain the integrity of the British Passport.</p><p>These checks can require the provision of information from other agencies overseas – particularly in complex applications such as surrogacy cases.</p><p>Delays in the provision of this information to HMPO can lead to significantly extended timeframe in processing applications.</p><p> </p><p> </p>","Old Bexley and Sidcup","James Brokenshire","2015-07-15T15:19:26.67Z","2015-08-05T14:35:08.02Z","http://data.parliament.uk/resources/388302/answer","Biography information for James Brokenshire","http://data.parliament.uk/resources/388302/answer",,,"http://data.parliament.uk/resources/388302/answer","Old Bexley and Sidcup","James Brokenshire","http://data.parliament.uk/resources/388302/answer/previousversion/15266","Biography information for James Brokenshire","http://data.parliament.uk/resources/388302/answer/previousversion/15266",,,"1","Home Office","Home Office","2015-07-07","Passports: British Nationals Abroad","1","House of Commons","To ask the Secretary of State for the Home Department, what the average time is for processing a passport application for a child overseas from the initial application to the interview in connection with that application.","false","Biography information for Tommy Sheppard","Edinburgh East","Tommy Sheppard","5848"
"http://data.parliament.uk/resources/387869","Home Office","true","2015-07-13","<p>Three companies bid for the Secure English Language Test for applicants abroad. <ins class="ministerial">Four companies bid for the Secure English Language Test for applicants within the UK.</ins> The contract was awarded to IELTS Consortium; the Consortium is made up of Cambridge English Language Assessment as Consortium Lead, with British Council and IDP IELTS Australia. The Concession Agreement is cost neutral as it was procured as a concession, rather than a contract, with test-takers paying the test provider directly. The Home Office has not provided funding to the service providers under this arrangement. An estimate of the market value is approximately £60 million per annum worldwide, based on expected volumes of upwards of 400,000 SELT tests at an average cost of £150 per test.</p>","Old Bexley and Sidcup","James Brokenshire","2015-07-13T14:25:42.373Z","2015-07-21T16:00:55.6Z","http://data.parliament.uk/resources/387869/answer","Biography information for James Brokenshire","http://data.parliament.uk/resources/387869/answer",,,"http://data.parliament.uk/resources/387869/answer","Old Bexley and Sidcup","James Brokenshire","http://data.parliament.uk/resources/387869/answer/previousversion/13700","Biography information for James Brokenshire","http://data.parliament.uk/resources/387869/answer/previousversion/13700",,,"1","Home Office","Home Office","2015-07-06","Entry Clearances: English Language","1","House of Commons","To ask the Secretary of State for the Home Department, how many companies bid for the Secure English Language Test for applicants abroad; what the value was of that contract; and who was awarded that contract.","false","Biography information for Keith Vaz","Leicester East","Keith Vaz","5707"
"http://data.parliament.uk/resources/226039","Home Office","true","2015-03-16","<p>The number of agency workers employed by (a) the Home Department, (b) Her Majesty’s Passport Office, (c) UK Visas and Immigration and (d) Border Force is <br />provided in Table 1.<br /><br />The number of full-time equivalent staff employed and the projected staffing levels for March 2015 broken down by (a) the Home Department, (b) Her Majesty’s <br />Passport Office, (c) UK Visas and Immigration and (d) Border Force is provided in Table 2.<br /><br />The information provided for staff and agency workers in post is as at 31st January 2015.<br /><br />The Home Department is currently finalising projected staffing levels for 2015-16 as part of the annual planning round so projected levels beyond March 2015 are not yet available.</p><p> </p><p> </p><p> </p>","Old Bexley and Sidcup","James Brokenshire","2015-03-16T15:04:13.367Z","2015-03-26T12:03:07.637Z","http://data.parliament.uk/resources/226039/answer","Biography information for James Brokenshire","http://data.parliament.uk/resources/226039/answer","Copy of PQ 226758 Table 1 and 226759 Table 2 V2.xls","NEW TABLES","http://data.parliament.uk/resources/226039/answer","Old Bexley and Sidcup","James Brokenshire","http://data.parliament.uk/resources/226039/answer/previousversion/50156","Biography information for James Brokenshire","http://data.parliament.uk/resources/226039/answer/previousversion/50156","PQ 226758 Table 1 and 226759 Table 2.xlsx","Agency workers and the full-time employed","1","Home Office","Home Office","2015-03-09","Agency Workers","1","House of Commons","To ask the Secretary of State for the Home Department, how many agency staff are employed in (a) her Department, (b) the Passport Office, (c) UK Visas Immigration and (d) the Border Force.","false","Biography information for David Hanson","Delyn","Mr David Hanson","226758"
"http://data.parliament.uk/resources/226040","Home Office","true","2015-03-16","<p>The number of agency workers employed by (a) the Home Department, (b) Her Majesty’s Passport Office, (c) UK Visas and Immigration and (d) Border Force is <br />provided in Table 1.<br /><br />The number of full-time equivalent staff employed and the projected staffing levels for March 2015 broken down by (a) the Home Department, (b) Her Majesty’s <br />Passport Office, (c) UK Visas and Immigration and (d) Border Force is provided in Table 2.<br /><br />The information provided for staff and agency workers in post is as at 31st January 2015.<br /><br />The Home Department is currently finalising projected staffing levels for 2015-16 as part of the annual planning round so projected levels beyond March 2015 are not yet available.</p><p> </p><p> </p><p> </p>","Old Bexley and Sidcup","James Brokenshire","2015-03-16T15:04:13.427Z","2015-03-26T12:07:37.43Z","http://data.parliament.uk/resources/226040/answer","Biography information for James Brokenshire","http://data.parliament.uk/resources/226040/answer","Copy of PQ 226758 Table 1 and 226759 Table 2 V2.xls","NEW TABLE","http://data.parliament.uk/resources/226040/answer","Old Bexley and Sidcup","James Brokenshire","http://data.parliament.uk/resources/226040/answer/previousversion/50331","Biography information for James Brokenshire","http://data.parliament.uk/resources/226040/answer/previousversion/50331","PQ 226758 Table 1 and 226759 Table 2.xlsx","Agency workers and the full-time employed","1","Home Office","Home Office","2015-03-09","Staff","1","House of Commons","To ask the Secretary of State for the Home Department, how many full-time equivalent staff there are in (a) her Department, (b) the Passport Office, (c) the Border Force and (d) UK Visas and Immigration; and what the projected staffing levels are for each such body for (i) March 2015, (ii) November 2015, (iii) March 2016 and (iv) November 2016.","false","Biography information for David Hanson","Delyn","Mr David Hanson","226759"
"http://data.parliament.uk/resources/175778","Home Office","true","2015-02-04","<p>The information requested is <ins class="ministerial">shown</ins> in the following table. The figures are based on the number of civil penalties issued to individual employers during each of the last five complete financial years. This includes public and private limited <br />companies, sole traders, partnerships and franchises. <br /><br />The government is committed to taking effective action against employers of illegal workers. Illegal working drives illegal immigration which leads to exploitation of workers and is also linked to non payment of the national <br />minimum wage, harmful working conditions and tax evasion. Illegal working also undercuts legitimate businesses and adversely impacts on the employment of people who are lawfully resident in the UK.<br /><br />The government has therefore taken measures to strengthen our approach to rogue employers. In 2014, we doubled the maximum civil penalty that can be levied against an employer to £20,000 per illegal worker and we used the Immigration Act 2014 to make it easier to enforce unpaid penalties in the courts. We have also extended our enforcement reach by working more closely across government departments to identify where illegal working is taking place and to enforce a range of sanctions against employers of illegal workers.</p><table><tbody><tr><td><ins class="ministerial">Financial year </ins></td><td><ins class="ministerial">Civil penalties issued </ins></td><td><ins class="ministerial">Employers issued with civil penalties </ins></td></tr><tr><td><ins class="ministerial">2009-10</ins></td><td><ins class="ministerial">2,339</ins></td><td><ins class="ministerial">2,254</ins></td></tr><tr><td><ins class="ministerial">2010-11</ins></td><td><ins class="ministerial">1,899</ins></td><td><ins class="ministerial">1,849</ins></td></tr><tr><td><ins class="ministerial">2011-12</ins></td><td><ins class="ministerial">1,341</ins></td><td><ins class="ministerial">1,317</ins></td></tr><tr><td><ins class="ministerial">2012-13</ins></td><td><ins class="ministerial">1,270</ins></td><td><ins class="ministerial">1,247</ins></td></tr><tr><td><ins class="ministerial">2013-14</ins></td><td><ins class="ministerial">2,150</ins></td><td><ins class="ministerial">2,090</ins></td></tr></tbody></table><p> </p><p> </p>","Hemel Hempstead","Mike Penning","2015-02-04T12:43:46.657Z","2015-02-06T10:41:06.507Z","http://data.parliament.uk/resources/175778/answer","Biography information for Sir Mike Penning","http://data.parliament.uk/resources/175778/answer",,,"http://data.parliament.uk/resources/175778/answer","Hemel Hempstead","Mike Penning","http://data.parliament.uk/resources/175778/answer/previousversion/42849","Biography information for Sir Mike Penning","http://data.parliament.uk/resources/175778/answer/previousversion/42849",,,"1","Home Office","Home Office","2015-01-26","Undocumented Workers: Fines","1","House of Commons","To ask the Secretary of State for the Home Department, how many companies were fined for employing illegal immigrants in each of the last five years.","false","Biography information for David Hanson","Delyn","Mr David Hanson","222054"
"http://data.parliament.uk/resources/170475","Home Office","true","2015-01-05","<p>There are approximately 7,900 Home Office staff employed by Border Force on the front line at the UK border. The annual cost of these staff is approximately £373 million.<br /><br />Please note these figures are part of the current year’s expenditure and so will be subject to audit. These are Home Office staff and do not include staff working for other agencies.</p><p> </p>","Hornsey and Wood Green","Lynne Featherstone","2015-01-05T11:34:20.863Z","2015-01-08T10:29:56.42Z","http://data.parliament.uk/resources/170475/answer","Biography information for Baroness Featherstone","http://data.parliament.uk/resources/170475/answer",,,"http://data.parliament.uk/resources/170475/answer","Old Bexley and Sidcup","James Brokenshire","http://data.parliament.uk/resources/170475/answer/previousversion/36659","Biography information for James Brokenshire","http://data.parliament.uk/resources/170475/answer/previousversion/36659",,,"1","Home Office","Home Office","2014-12-15","UK Border Force","1","House of Commons","To ask the Secretary of State for the Home Department, how many front-line staff are employed at the UK border; and what the annual cost to the public purse is of such staff.","false","Biography information for Dominic Raab","Esher and Walton","Mr Dominic Raab","218616"
"http://data.parliament.uk/resources/168978","Home Office","true","2015-01-05","<p>Expenditure incurred by the Home Department and its agencies on consultants, <br />temporary staff and contingent labour in the last five years is published <br />annually in the Home Office Annual Report and Accounts, copies of which are <br />held in the House Library and available from these links.<br /><br /><a href="https://www.gov.uk/government/publications/home-office-annual-report-and-accounts-2013-to-2014" target="_blank">https://www.gov.uk/government/publications/home-office-annual-report-and-accounts-2013-to-2014</a> <br /><a href="https://www.gov.uk/government/publications/home-office-annual-report-and-accounts-2012-to-2013" target="_blank">https://www.gov.uk/government/publications/home-office-annual-report-and-accounts-2012-to-2013</a> <br /><a href="https://www.gov.uk/government/publications/home-office-annual-report-and-accounts-2011-to-2012" target="_blank">https://www.gov.uk/government/publications/home-office-annual-report-and-accounts-2011-to-2012</a><br /><a href="https://www.gov.uk/government/publications/ho-annual-report-and-accounts-2010-to-2011" target="_blank">https://www.gov.uk/government/publications/ho-annual-report-and-accounts-2010-to-2011</a><br /><a href="https://www.gov.uk/government/publications/home-office-resource-accounts-2009-to-2010" target="_blank">https://www.gov.uk/government/publications/home-office-resource-accounts-2009-to-2010</a><br /><a href="https://www.gov.uk/government/uploads/system/uploads/attachment_data/file/247694/0193.pdf" target="_blank">https://www.gov.uk/government/uploads/system/uploads/attachment_data/file/247694/0193.pdf</a><br /><br />The Department did not separately account for Agency Staff (Temporary Workers) <br />in these years as the costs associated with this category are included in the <br />overall Contingent Labour figures. <br /><br />Spend on contingent and consultancy labour has decreased significantly overall <br />since 09/10.<br /><br /></p><table><tbody><tr><td> </td><td><p><strong>FY09/10 </strong></p></td><td><p><strong>FY10/11</strong></p></td><td><p><strong>FY11/12</strong></p></td><td><p><strong>FY12/13</strong></p></td><td><p><strong>FY13/14</strong></p></td></tr><tr><td> </td><td><p>£m</p></td><td><p>£m</p></td><td><p>£m</p></td><td><p>£m</p></td><td><p>£m</p></td></tr><tr><td><p><strong>Consultancy</strong></p></td><td><p>£227.470</p></td><td><p>£64.194</p></td><td><p>£33.301</p></td><td><p>£14.762</p></td><td><p>£18.014</p></td></tr><tr><td><p><strong>Contingent Labour </strong></p></td><td><p>£134.000</p></td><td><p>£51.472</p></td><td><p>£37.772</p></td><td><p>£50.672</p></td><td><p>£72.430</p></td></tr></tbody></table><p> </p><p> </p><p> </p><p> </p><p> </p><p> </p><p> </p><p>The Department engages Temporary Staff at AA, AO, EO, HEO and SEO equivalent <br />Grades, the vast majority at the AA to EO grades. Contractors are engaged in <br />grade equivalents EO to SCS PB1 with the vast majority at SEO and G6/7.<br /><br />The Department buys consultancy as a service and therefore does not engage <br />consultants individually.<br /><br />To provide details of contract durations and equivalent grades would require <br />analysis of individual contracts and disparate datasets, the time taken to <br />undertake this task would incur disproportionate cost.</p><p> </p>","Hornsey and Wood Green","Lynne Featherstone","2015-01-05T11:40:14.497Z","2015-01-06T11:32:10.39Z","http://data.parliament.uk/resources/168978/answer","Biography information for Baroness Featherstone","http://data.parliament.uk/resources/168978/answer",,,"http://data.parliament.uk/resources/168978/answer","Staffordshire Moorlands","Karen Bradley","http://data.parliament.uk/resources/168978/answer/previousversion/36668","Biography information for Dame Karen Bradley","http://data.parliament.uk/resources/168978/answer/previousversion/36668",,,"1","Home Office","Home Office","2014-12-09","Staff","1","House of Commons","To ask the Secretary of State for the Home Department, how much her Department has spent on (a) consultants, (b) temporary staff and (c) contingent labour in each of the last five years; how many people have been so employed; what the length of contract of each such person was; and what equivalent civil service salary band each was on.","false","Biography information for Lucy Powell","Manchester Central","Lucy Powell","217779"