"uri","answering body","answer > is ministerial correction","answer > date of answer","answer > answer text","answer > answering member constituency","answer > answering member printed","answer > question first answered","answer > uri","answer > answering member > label","answer > uri","answer > previous answer version > answering member constituency","answer > previous answer version > answering member printed","answer > previous answer version > uri","answer > previous answer version > answering member > label","answering dept id","answering dept short name","answering dept sort name","date","hansard heading","house id","legislature > pref label","question text","registered interest","tabling member > label","tabling member constituency","tabling member printed","uin"
"http://data.parliament.uk/resources/1141741","Church Commissioners","false","2019-09-03","<p>The policies, structures and strategic development of the Anglican Communion are not matters for which the Church Commissioners has responsibility.</p>","Meriden","Dame Caroline Spelman","2019-09-03T14:00:55.037Z","http://data.parliament.uk/resources/1141741/answer","Biography information for Dame Caroline Spelman","http://data.parliament.uk/resources/1141741/answer",,,,,"9","Church Commissioners","Church Commissioners","2019-07-24","Anglicanism","1","House of Commons","To ask the right hon. Member for Meriden, representing the Church Commissioners, whether the Church of England has plans to adopt the approach of the Global Anglican Future Conference as a model for the (a) growth and (b) development of the Anglican Communion.","false","Biography information for Sir John Hayes","South Holland and The Deepings","Sir John Hayes","281578"
"http://data.parliament.uk/resources/1141744","Church Commissioners","false","2019-09-03","<p>At previous meetings of the Global Anglican Future Conference the Archbishop of Canterbury has been represented by a diocesan bishop of the Church of England. No decision has yet been taken by the Archbishop of Canterbury about whether he or a representative will attend the 2020 Conference in Kigali.</p>","Meriden","Dame Caroline Spelman","2019-09-03T14:04:02.773Z","http://data.parliament.uk/resources/1141744/answer","Biography information for Dame Caroline Spelman","http://data.parliament.uk/resources/1141744/answer",,,,,"9","Church Commissioners","Church Commissioners","2019-07-24","Global Anglican Future Conference: Rwanda","1","House of Commons","To ask the right hon. Member for Meriden, representing the Church Commissioners, whether the Archbishop of Canterbury plans to attend the 2020 Global Anglican Future Conference in Kigali, Rwanda.","false","Biography information for Sir John Hayes","South Holland and The Deepings","Sir John Hayes","281579"
"http://data.parliament.uk/resources/1141745","Church Commissioners","false","2019-09-03","<p>The Church of England is currently undertaking a consultative process called ‘Living in Love and Faith’, which is considering all matters of sexuality and gender.</p><p>In 2018 the House of Bishops issued Pastoral Guidance for use in conjunction with the Affirmation of Baptismal Faith in the context of gender transition, which can be found here: <a href="https://www.churchofengland.org/sites/default/files/2018-12/Pastoral%20Guidance-Affirmation-Baptismal-Faith.pdf" target="_blank">https://www.churchofengland.org/sites/default/files/2018-12/Pastoral%20Guidance-Affirmation-Baptismal-Faith.pdf</a></p>","Meriden","Dame Caroline Spelman","2019-09-03T14:05:54.393Z","http://data.parliament.uk/resources/1141745/answer","Biography information for Dame Caroline Spelman","http://data.parliament.uk/resources/1141745/answer",,,,,"9","Church Commissioners","Church Commissioners","2019-07-24","Transgender People","1","House of Commons","To ask the right hon. Member for Meriden, representing the Church Commissioners, if the Church of England will clarify its interpretation of biblical teaching on sex and gender in relation to transgender issues.","false","Biography information for Sir John Hayes","South Holland and The Deepings","Sir John Hayes","281580"
"http://data.parliament.uk/resources/1141746","Church Commissioners","false","2019-09-03","<p>It is not possible to give the proportion of employees either at a parish, diocesan or national institution-level who are practising Christians as information on this is not recorded or held centrally. Some posts within the National Church Institutions have a Genuine Occupational Requirement to either be a ‘Practising or Communicant member of the Church of England or a member of a Church in communion with the Church of England’.</p>","Meriden","Dame Caroline Spelman","2019-09-03T14:06:25.3Z","http://data.parliament.uk/resources/1141746/answer","Biography information for Dame Caroline Spelman","http://data.parliament.uk/resources/1141746/answer",,,,,"9","Church Commissioners","Church Commissioners","2019-07-24","Church of England: Staff","1","House of Commons","To ask the right hon. Member for Meriden, representing the Church Commissioners, what proportion of Church of England employees are practising Christians.","false","Biography information for Sir John Hayes","South Holland and The Deepings","Sir John Hayes","281581"
"http://data.parliament.uk/resources/1141747","Church Commissioners","false","2019-09-03","<p>The founding theology of the Church of England is drawn from a combination of documents, beliefs and practices known as the ‘Historic Formularies’ and Canon Law. The Historic Formularies consist of scripture, the Book of Common Prayer, the 39 Articles of Religion and the Ordinal.</p><p>Priests of the Church of England are required to affirm their acceptance of the Historic Formularies at their ordination during the Declaration of Assent. The text of this can be found under Canon C15: <a href="https://www.churchofengland.org/more/policy-and-thinking/canons-church-england/section-c" target="_blank">https://www.churchofengland.org/more/policy-and-thinking/canons-church-england/section-c</a></p>","Meriden","Dame Caroline Spelman","2019-09-03T14:07:42.067Z","http://data.parliament.uk/resources/1141747/answer","Biography information for Dame Caroline Spelman","http://data.parliament.uk/resources/1141747/answer",,,,,"9","Church Commissioners","Church Commissioners","2019-07-24","Church of England: Theology","1","House of Commons","To ask the right hon. Member for Meriden, representing the Church Commissioners, what steps the Church of England is taking to help ensure that its theology is founded on the 39 articles.","false","Biography information for Sir John Hayes","South Holland and The Deepings","Sir John Hayes","281582"
"http://data.parliament.uk/resources/1141748","Church Commissioners","false","2019-09-03","<p>Archbishop Rowan Willams responded to the publication of the Jerusalem Statement by the Global Anglican Futures Conference in 2008, the full text of which can be found here:</p><p><a href="https://www.anglicannews.org/news/2008/06/archbishop-of-canterbury-responds-to-gafcon-statement.aspx" target="_blank">https://www.anglicannews.org/news/2008/06/archbishop-of-canterbury-responds-to-gafcon-statement.aspx</a></p><p>The Archbishop of Canterbury Justin Welby is committed to pointing towards the good news of Jesus and the renewal of the Church. The Archbishop is looking forward to the Lambeth Conference taking place in 2020 with the theme “God’s Church for God’s world.</p><p> </p>","Meriden","Dame Caroline Spelman","2019-09-03T14:08:27.357Z","http://data.parliament.uk/resources/1141748/answer","Biography information for Dame Caroline Spelman","http://data.parliament.uk/resources/1141748/answer",,,,,"9","Church Commissioners","Church Commissioners","2019-07-24","Anglicanism","1","House of Commons","To ask the right hon. Member for Meriden, representing the Church Commissioners, whether the Archbishop of Canterbury will pledge his commitment to the Jerusalem Statement of 2008.","false","Biography information for Sir John Hayes","South Holland and The Deepings","Sir John Hayes","281583"
"http://data.parliament.uk/resources/1140803","Church Commissioners","false","2019-07-25","<p>The Church of England’s Church Buildings Council regularly communicates with all grant-making bodies and information about the grants available to parishes is communicated through the Diocesan Advisory Committees.</p><p>The Church of England offers general advice to its parishes about restoration, repair and grants on the Church Care section of its website: <a href="https://www.churchofengland.org/more/church-resources/churchcare" target="_blank">https://www.churchofengland.org/more/church-resources/churchcare</a></p>","Meriden","Dame Caroline Spelman","2019-07-25T16:24:32.21Z","http://data.parliament.uk/resources/1140803/answer","Biography information for Dame Caroline Spelman","http://data.parliament.uk/resources/1140803/answer",,,,,"9","Church Commissioners","Church Commissioners","2019-07-22","Churches: Grants","1","House of Commons","To ask the right hon. Member for Meriden, representing the Church Commissioners, what steps are being taken to promote the new four year Grant Programme through the Churches Trust.","false","Biography information for Mr Gregory Campbell","East Londonderry","Mr Gregory Campbell","280172"
"http://data.parliament.uk/resources/1140278","Church Commissioners","false","2019-07-25","<p>The Church of England’s Mission and Public Affairs Division sponsored the debate at the General Synod in July 2019 and is working with dioceses to develop best practice information and training for church leaders and communities to tackle serious youth violence.</p>","Meriden","Dame Caroline Spelman","2019-07-25T16:25:09.44Z","http://data.parliament.uk/resources/1140278/answer","Biography information for Dame Caroline Spelman","http://data.parliament.uk/resources/1140278/answer","Meriden","Dame Caroline Spelman","http://data.parliament.uk/resources/1140278/answer/previousversion/130242","Biography information for Dame Caroline Spelman","9","Church Commissioners","Church Commissioners","2019-07-18","Crimes of Violence: Young People","1","House of Commons","To ask the right hon. Member for Meriden, representing the Church Commissioners, what steps the Church of England plans to take to implement the decision taken at the General Synod in July 2019 in relation to the motion on Tackling Serious Youth Violence.","false","Biography information for Vicky Foxcroft","Lewisham, Deptford","Vicky Foxcroft","279089"
"http://data.parliament.uk/resources/1140279","Church Commissioners","false","2019-07-25","<p>The Church of England Vision for Education identifies four core themes (wisdom, knowledge and skills; hope and aspiration; community and living well together; dignity and respect) which underpin all of our work in education. School leadership networks will be focusing on serious youth violence as part of these core themes. An education which promotes hope, aspiration and dignity is a vital part of addressing serious youth violence.</p><p>One aspect of this debate relates to the impact of school exclusions on vulnerable young people. Church of England schools exclude fewer children than non-church schools and the Church’s commitment to the vulnerable and disadvantaged means that we will continue to explore ways of further reducing the negative impact of exclusion.</p>","Meriden","Dame Caroline Spelman","2019-07-25T16:25:37.57Z","http://data.parliament.uk/resources/1140279/answer","Biography information for Dame Caroline Spelman","http://data.parliament.uk/resources/1140279/answer","Meriden","Dame Caroline Spelman","http://data.parliament.uk/resources/1140279/answer/previousversion/130244","Biography information for Dame Caroline Spelman","9","Church Commissioners","Church Commissioners","2019-07-18","Crimes of Violence: Young People","1","House of Commons","To ask the right hon. Member for Meriden, representing the Church Commissioners, what steps the Church of England’s Education Department is taking to implement the decision taken at the General Synod in July 2019 in relation to the motion on tackling serious youth violence in schools; and what guidance it is planning to issue to youth workers.","false","Biography information for Vicky Foxcroft","Lewisham, Deptford","Vicky Foxcroft","279090"
"http://data.parliament.uk/resources/1139907","Church Commissioners","false","2019-07-22","<p>Gambling-related harm impacts the lives of hundreds of thousands of people across the country. Of particular concern is the 55,000 children classified as problem gamblers in Great Britain.</p><p> </p><p>The Church of England and the bishops in the House of Lords have regularly raised this issue with the Government, charities and the industry itself.</p><p> </p><p>The Bishop of St Albans successfully campaigned with others to reduce the stake on fixed-odds betting terminals in Great Britain and tabled an amendment to the Northern Ireland Executive (Formation) Bill 2019 to ask the Government to report on the case for legislative and regulatory alignment between Great Britain and Northern Ireland. The Government accepted this amendment.</p><p> </p><p>The Bishop of St Albans also sponsored a motion for debate in the General Synod of the Church of England, which was passed at the February 2019 session. He also successfully balloted for the House of Lords to establish the Select Committee on the Social and Economic Impact of the Gambling Industry. The Committee Inquiry is underway and is expected to report between March and April 2020.</p>","Meriden","Dame Caroline Spelman","2019-07-22T15:27:50.57Z","http://data.parliament.uk/resources/1139907/answer","Biography information for Dame Caroline Spelman","http://data.parliament.uk/resources/1139907/answer",,,,,"9","Church Commissioners","Church Commissioners","2019-07-17","Gambling","1","House of Commons","To ask the right hon. Member for Meriden, representing the Church Commissioners, what steps the Church of England is taking to tackle problem gambling.","false","Biography information for Mr Gregory Campbell","East Londonderry","Mr Gregory Campbell","278399"
