"uri","answering body","answer > is ministerial correction","answer > date of answer","answer > answer text","answer > answering member constituency","answer > answering member printed","answer > grouped question UIN","answer > question first answered","answer > uri","answer > answering member > label","answer > uri","answer > previous answer version > answering member constituency","answer > previous answer version > answering member printed","answer > previous answer version > uri","answer > previous answer version > answering member > label","answering dept id","answering dept short name","answering dept sort name","date","hansard heading","house id","legislature > pref label","question text","registered interest","tabling member > label","tabling member constituency","tabling member printed","uin"
"http://data.parliament.uk/resources/1507076","Department for Transport","false","2022-09-28","<p>Network Rail has well-established operational measures it implements to protect infrastructure and manage services safely during extreme weather events, such as line speed restrictions, diversions and painting parts of the railway tracks white.</p><p> </p><p>Looking ahead, we want industry to proactively prepare wherever possible, but also to explore new technology which could help improve resilience.</p><p> </p><p>Network Rail launched a resilience task force in July to review the UK rail networks capacity to deal with extreme heat, which will be led by independent experts. It will make recommendations on how the railway can develop its approach to resilience during hot weather.</p>","Torbay","Kevin Foster",,"2022-09-28T08:54:59.367Z","http://data.parliament.uk/resources/1507076/answer","Biography information for Kevin Foster","http://data.parliament.uk/resources/1507076/answer",,,,,"27","Transport","Transport","2022-09-20","Railway Track: Temperature","1","House of Commons","To ask the Secretary of State for Transport, what steps her Department is taking to ensure that train tracks can function as normal during heatwaves.","false","Biography information for Catherine West","Hornsey and Wood Green","Catherine West","51889"
"http://data.parliament.uk/resources/1486078","Home Office","false","2022-07-07","<p>Casework systems do not allow us to report on the number of permission to work requests received or the number subsequently granted permission. Obtaining these figures would require manually searching through cases amounting to disproportionate time and cost.</p><p>Asylum seekers are allowed to work in the UK if their claim has been outstanding for 12 months or more, through no fault of their own. Those permitted to work are restricted to jobs on the Shortage Occupation List (SOL).</p>","Torbay","Kevin Foster",,"2022-07-07T08:48:27.697Z","http://data.parliament.uk/resources/1486078/answer","Biography information for Kevin Foster","http://data.parliament.uk/resources/1486078/answer",,,,,"1","Home Office","Home Office","2022-07-04","Asylum: Employment","1","House of Commons","To ask the Secretary of State for the Home Department, what the average time taken is for her Department to respond following the submission by an asylum seeker of a request for permission to work.","false","Biography information for Catherine West","Hornsey and Wood Green","Catherine West","30083"
"http://data.parliament.uk/resources/1468578","Home Office","false","2022-06-15","<p>Any customer who has submitted a passport application using Her Majesty’s Passport Office’s standard service and now needs their passport sooner, is advised to contact the Passport Adviceline to discuss any available options.</p>","Torbay","Kevin Foster",,"2022-06-15T09:57:26.363Z","http://data.parliament.uk/resources/1468578/answer","Biography information for Kevin Foster","http://data.parliament.uk/resources/1468578/answer","Torbay","Kevin Foster","http://data.parliament.uk/resources/1468578/answer/previousversion/5694","Biography information for Kevin Foster","1","Home Office","Home Office","2022-06-08","Passports: Applications","1","House of Commons","To ask the Secretary of State for the Home Department, how long applicants for a British passport (a) renewal and (b) replacement must wait before requesting their application is upgraded by Her Majesty's Passport Office.","false","Biography information for Catherine West","Hornsey and Wood Green","Catherine West","14572"
"http://data.parliament.uk/resources/1467526","Home Office","false","2022-06-15","<p>The Homes for Ukraine scheme is run and maintained by the Department for Levelling Up, Housing &amp; Communities. More information can be found at</p><p><a href="https://www.gov.uk/guidance/homes-for-ukraine-scheme-frequently-asked-questions" target="_blank">https://www.gov.uk/guidance/homes-for-ukraine-scheme-frequently-asked-questions</a></p>","Torbay","Kevin Foster",,"2022-06-15T09:05:36.52Z","http://data.parliament.uk/resources/1467526/answer","Biography information for Kevin Foster","http://data.parliament.uk/resources/1467526/answer",,,,,"1","Home Office","Home Office","2022-06-01","Homes for Ukraine Scheme: Children","1","House of Commons","To ask the Secretary of State for the Home Department, what is her Department's policy on awarding visas to minors travelling with non-parental relatives who are their legal guardians under the Homes for Ukraine scheme.","false","Biography information for Catherine West","Hornsey and Wood Green","Catherine West","11784"
"http://data.parliament.uk/resources/1465299","Home Office","false","2022-05-31","<p>The High Potential Individual route is a highly selective route. It is designed to attract individuals who are at an early stage of their career who have demonstrated their potential through academic achievement at a limited number of universities outside of the UK.</p><p> </p><p>Graduates of all UK universities are already able to remain and work in the UK for the same period through the Graduate route.</p>","Torbay","Kevin Foster",,"2022-05-31T13:58:45.453Z","http://data.parliament.uk/resources/1465299/answer","Biography information for Kevin Foster","http://data.parliament.uk/resources/1465299/answer",,,,,"1","Home Office","Home Office","2022-05-24","Visas: Graduates","1","House of Commons","To ask the Secretary of State for the Home Department, what assessment she has made of the potential merits of enabling graduates from high-ranking UK universities to apply for the High Potential Individual visa.","false","Biography information for Catherine West","Hornsey and Wood Green","Catherine West","8093"
"http://data.parliament.uk/resources/1464437","Home Office","false","2022-06-01","<p>Applicants for the Homes for Ukraine Sponsorship Scheme must be Ukrainian, or the immediate family member of a Ukrainian national, and either:</p><ul><li>18 or older on the date of application or</li><li>under 18 years old and applying with your parent or legal guardian, or to join them in the UK</li></ul><p>Please see: <a href="https://www.gov.uk/guidance/immigration-rules" target="_blank">https://www.gov.uk/guidance/immigration-rules</a></p>","Torbay","Kevin Foster","5468","2022-06-01T10:36:22.49Z","http://data.parliament.uk/resources/1464437/answer","Biography information for Kevin Foster","http://data.parliament.uk/resources/1464437/answer","Torbay","Kevin Foster","http://data.parliament.uk/resources/1464437/answer/previousversion/3119","Biography information for Kevin Foster","1","Home Office","Home Office","2022-05-19","Homes for Ukraine Scheme: Children","1","House of Commons","To ask the Secretary of State for the Home Department, whether applications under the Homes for Ukraine scheme can be accepted where the applicant is a minor travelling with a family member who is not a parent.","false","Biography information for Catherine West","Hornsey and Wood Green","Catherine West","5467"
"http://data.parliament.uk/resources/1464447","Home Office","false","2022-06-01","<p>Applicants for the Homes for Ukraine Sponsorship Scheme must be Ukrainian, or the immediate family member of a Ukrainian national, and either:</p><ul><li>18 or older on the date of application or</li><li>under 18 years old and applying with your parent or legal guardian, or to join them in the UK</li></ul><p>Please see: <a href="https://www.gov.uk/guidance/immigration-rules" target="_blank">https://www.gov.uk/guidance/immigration-rules</a></p>","Torbay","Kevin Foster","5467","2022-06-01T10:36:22.553Z","http://data.parliament.uk/resources/1464447/answer","Biography information for Kevin Foster","http://data.parliament.uk/resources/1464447/answer","Torbay","Kevin Foster","http://data.parliament.uk/resources/1464447/answer/previousversion/3120","Biography information for Kevin Foster","1","Home Office","Home Office","2022-05-19","Homes for Ukraine Scheme: Children","1","House of Commons","To ask the Secretary of State for the Home Department, what legal documentation is required under the Homes for Ukraine scheme for a minor travelling without a parent but with an adult family member, such as an aunt or grandparent.","false","Biography information for Catherine West","Hornsey and Wood Green","Catherine West","5468"
"http://data.parliament.uk/resources/1463538","Home Office","false","2022-06-01","<p>The Skilled Worker Visa is open to all nationals, subject to immigration and criminality checks.</p>","Torbay","Kevin Foster",,"2022-06-01T16:33:38.273Z","http://data.parliament.uk/resources/1463538/answer","Biography information for Kevin Foster","http://data.parliament.uk/resources/1463538/answer","Torbay","Kevin Foster","http://data.parliament.uk/resources/1463538/answer/previousversion/3131","Biography information for Kevin Foster","1","Home Office","Home Office","2022-05-17","Visas: Russia","1","House of Commons","To ask the Secretary of State for the Home Department, whether the war in Ukraine is having an impact on the (a) eligibility of Russian nationals for skilled worker visas and (b) availability of such visas for Russian nationals.","false","Biography information for Catherine West","Hornsey and Wood Green","Catherine West","3691"
"http://data.parliament.uk/resources/1463546","Home Office","false","2022-05-26","<p>We do not have any plans to waive visa application fees for language assistants who are looking to use the Points Based System to work in UK schools.</p><p> </p><p>Fees provide a vital contribution towards the provision of the resources necessary to operate and sustain our borders and immigration system. This reduces reliance on taxpayer funding, while ensuring the costs of the system are met. It would be unfair to the taxpayer and other users of the immigration system if we were to exempt EU citizens seeking work as language assistants given our migration system is now a global one, not one determined by whether you hold an EEA or non-EEA passport</p>","Torbay","Kevin Foster",,"2022-05-26T10:46:31.22Z","http://data.parliament.uk/resources/1463546/answer","Biography information for Kevin Foster","http://data.parliament.uk/resources/1463546/answer","Torbay","Kevin Foster","http://data.parliament.uk/resources/1463546/answer/previousversion/3130","Biography information for Kevin Foster","1","Home Office","Home Office","2022-05-17","Migrant Workers: Schools","1","House of Commons","To ask the Secretary of State for the Home Department, if she will remove visa costs for EU citizens who are planning to work as language assistants in UK schools.","false","Biography information for Catherine West","Hornsey and Wood Green","Catherine West","3692"
"http://data.parliament.uk/resources/1463581","Home Office","false","2022-05-23","<p>Information on the number of visas granted under the Ukrainian Family Scheme and the Homes for Ukraine Scheme, divided by each local authority can be found in published data on the GOV.UK webpage: <a href="https://gbr01.safelinks.protection.outlook.com/?url=https%3A%2F%2Fwww.gov.uk%2Fgovernment%2Fpublications%2Fhomes-for-ukraine-sponsorship-scheme-numbers-of-visa-applications&amp;data=05%7C01%7CKeith.Edwards42%40homeoffice.gov.uk%7Cd774f60c0b5841dd6fc608da249107cc%7Cf24d93ecb2914192a08af182245945c2%7C0%7C0%7C637862502555631264%7CUnknown%7CTWFpbGZsb3d8eyJWIjoiMC4wLjAwMDAiLCJQIjoiV2luMzIiLCJBTiI6Ik1haWwiLCJXVCI6Mn0%3D%7C3000%7C%7C%7C&amp;sdata=VX3iShFYv%2Bf5vd4FcQcODk2CKv3c6OMY6KWo2ZAv10s%3D&amp;reserved=0" target="_blank">https://www.gov.uk/government/publications/homes-for-ukraine-sponsorship-scheme-numbers-of-visa-applications</a>)</p><p> </p><p>The Government does not collect constituency-level data on the Ukraine Family Scheme.</p><p> </p><p>In terms of priority, applications are normally processed in date order from when documents were uploaded, or after an appointment at a Visa Application Centre (VAC).</p><p> </p><p>However, as part of the Home Office’s commitment to make it easier for applicants to apply to our schemes, Ukrainians with valid passports no longer need to go to a Visa Application Centre to give their biometrics before they come to the UK. This revision to the process can mean applicants who submitted their applications at the same time, but via different biometric routes, may not receive their visas at the same time.</p>","Torbay","Kevin Foster","3695 ; 3698 ; 3699","2022-05-23T10:37:47.14Z","http://data.parliament.uk/resources/1463581/answer","Biography information for Kevin Foster","http://data.parliament.uk/resources/1463581/answer","Torbay","Kevin Foster","http://data.parliament.uk/resources/1463581/answer/previousversion/1463","Biography information for Kevin Foster","1","Home Office","Home Office","2022-05-17","Homes for Ukraine Scheme","1","House of Commons","To ask the Secretary of State for the Home Department, with reference to the Homes for Ukraine Scheme, what the average waiting time is between an applicant's visa receiving approval and that applicant receiving their permission to travel document.","false","Biography information for Catherine West","Hornsey and Wood Green","Catherine West","3694"
