"uri","answering body","answer > is ministerial correction","answer > date of answer","answer > answer text","answer > answering member printed","answer > grouped question UIN","answer > question first answered","answer > uri","answer > answering member > label","answer > uri","answer > attachment > file name","answer > attachment > title","answering dept id","answering dept short name","answering dept sort name","date","hansard heading","house id","legislature > pref label","question text","registered interest","tabling member > label","tabling member printed","uin"
"http://data.parliament.uk/resources/1127442","Department for Work and Pensions","false","2019-06-04","<p>The information on numbers of children entering and exiting poverty is not available. However, figures for percentages of children moving in and out of poverty are collected in the Income Dynamics publication. These are available in Table 8.1, and in the table below:</p><p> </p><table><tbody><tr><td><p> </p></td><td><p>2010-2011 to 2011-2012</p></td><td><p>2011-2012 to 2012-2013</p></td><td><p>2012-2013 to 2013-2014</p></td><td><p>2013-2014 to 2014-2015</p></td><td><p>2014-2015 to 2015-2016</p></td><td><p>2015-2016 to 2016-2017</p></td></tr><tr><td><p><strong>% children entering poverty</strong></p></td><td><p>6</p></td><td><p>6</p></td><td><p>6</p></td><td><p>7</p></td><td><p>6</p></td><td><p>7</p></td></tr><tr><td><p><strong>% children exiting poverty</strong></p></td><td><p>34</p></td><td><p>35</p></td><td><p>37</p></td><td><p>33</p></td><td><p>33</p></td><td><p>35</p></td></tr></tbody></table><p> </p><p>The percentage of children entering poverty is the percentage of only those children who were <em>not in poverty</em> in the earlier year but who were in poverty the following year. The percentage of children exiting poverty is the percentage of only those children who were <em>in poverty </em>in the earlier year but who were out of poverty the following year. Entry and exit rates are very different (since entry / exit rates are expressed as a percentage of only those not previously in poverty / previously in poverty respectively).</p><p /><p>The threshold used is 60 per cent of median equivalised household income Before Housing Costs (BHC). Since household incomes are subject to measurement error, and the threshold is subject to sampling and measurement error, the analysis only includes ‘clear’ transitions. For an entry/exit to count, household incomes must cross the 60 per cent of median income threshold and be at least 10 per cent higher / lower than the threshold in the following year.</p>","Baroness Buscombe",,"2019-06-04T16:27:01.013Z","http://data.parliament.uk/resources/1127442/answer","Biography information for Baroness Buscombe","http://data.parliament.uk/resources/1127442/answer",,,"29","Work and Pensions","Work and Pensions","2019-05-20","Poverty: Children","2","House of Lords","To ask Her Majesty's Government, further to the Written Answer by Lord Agnew of Oulton on 16 May (HL15606), whether they will now answer the question put.","false","Biography information for Baroness Primarolo","Baroness Primarolo","HL15853"
"http://data.parliament.uk/resources/1078284","Department for Work and Pensions","false","2019-03-05","<p>I refer the noble Lord to the answer I gave on Wednesday 27 February HL13942</p><p>There is clear evidence that work offers the best opportunity for families to move out of poverty and towards financial independence. Children in workless households are around 5 times more likely to be in poverty after housing costs than those where all adults work. 62% of children living in a workless couple family are in relative poverty (before housing costs) compared with only 3% where both adults work full-time.</p><p>This is why we are continuing to undertake the most ambitious reform to the welfare system in decades – so that it supports people to find and to stay in work. Nationally, there are now over 3.5 million more people in work. Universal Credit is at the heart of these reforms. It is designed to promote full-time work and employment for partners where possible, through smoother incentives to increase hours.</p><p>Working parents on UC can have up to 85% of their childcare costs reimbursed – worth up to £1,108 per month for someone with two or more children. We have also introduced additional flexibility on support for up front childcare costs, increased work allowances, and doubled free childcare available to working parents of 3 and 4 year olds to 30 hours per week.</p>","Baroness Buscombe",,"2019-03-05T16:03:19.933Z","http://data.parliament.uk/resources/1078284/answer","Biography information for Baroness Buscombe","http://data.parliament.uk/resources/1078284/answer",,,"29","Work and Pensions","Work and Pensions","2019-02-26","Poverty: Children","2","House of Lords","To ask Her Majesty's Government what plans they have to tackle child poverty across the United Kingdom.","false","Biography information for Lord Hay of Ballyore","Lord Hay of Ballyore","HL14056"
"http://data.parliament.uk/resources/802410","Department for Work and Pensions","false","2017-12-20","<p>Employment is key to helping people out of poverty and to make a real and lasting change to the lives of disadvantaged families and children. Our welfare and tax reforms are designed to incentivise employment and to support people to progress in work. Employment is now at near-record levels and the number of children living in a family where no one is working is 608,000 lower than it was in 2010. Improving Lives: Helping Workless Families, published on 4 April, set out a framework for a continued focus on improving children’s outcomes, now and in the future.</p><p> </p><p>The Department does not forecast estimates of low income, but the next HBAI publication for 2016/17 data has been <a href="https://www.gov.uk/government/statistics/announcements/households-below-average-income-199495-to-201617" target="_blank">pre-announced</a> and will be published by the end of March 2018. The government is committed to continue to publish this series on an annual basis.</p>","Baroness Buscombe",,"2017-12-20T13:55:33.513Z","http://data.parliament.uk/resources/802410/answer","Biography information for Baroness Buscombe","http://data.parliament.uk/resources/802410/answer",,,"29","Work and Pensions","Work and Pensions","2017-12-06","Poverty: Children","2","House of Lords","To ask Her Majesty's Government what assessment they have made of the implications for future advances in social mobility of the finding by the Institute for Fiscal Studies that almost 37 per cent of children will fall below the relative poverty line by 2021.","false","Biography information for Lord Ouseley","Lord Ouseley","HL3943"
"http://data.parliament.uk/resources/757324","Department for Work and Pensions","false","2017-09-14","<p>This Government is committed to action that will make a lasting difference to the lives of disadvantaged children. This requires an approach that goes beyond the safety net of the welfare state to tackle the root causes of child poverty and disadvantage. Work is key to alleviating poverty; children in workless households are five times more likely to be in poverty than those in households where all adults were working. This Government’s policies to support and encourage work mean that there are 608,000 fewer children in workless households compared with 2010. <em>Improving Lives: Helping Workless Families</em>, published on 4 April, set out a framework for a continued focus on improving children’s outcomes, now and in the future.</p><p> </p>","Baroness Buscombe",,"2017-09-14T11:15:32.587Z","http://data.parliament.uk/resources/757324/answer","Biography information for Baroness Buscombe","http://data.parliament.uk/resources/757324/answer",,,"29","Work and Pensions","Work and Pensions","2017-09-05","Poverty: Children","2","House of Lords","To ask Her Majesty's Government what steps they plan to take to improve the quality of life and future prospects for the four million children living in relative poverty in the UK.","false","Biography information for Lord Ouseley","Lord Ouseley","HL1309"
"http://data.parliament.uk/resources/641879","Department for Work and Pensions","false","2016-12-06","<p>This Government is committed to action that tackles the root causes of poverty and disadvantage, not just the symptoms. As part of our approach, we fully recognise that the right intervention, at the right time, can make a real difference to the lives of children and their families. This is why, for example, we are developing a new approach to relationship support. This is based on the latest evidence from the Early Intervention Foundation that children exposed to frequent, intense and poorly resolved conflict between their parents are at risk of poorer long term outcomes. Our approach targets couples and parents during key life transitions; and by doubling the available funding since April 2016 for the remainder of this Parliament we can ensure that more families benefit from this new approach.</p>","Lord Freud",,"2016-12-06T17:47:17.963Z","http://data.parliament.uk/resources/641879/answer","Biography information for Lord Freud","http://data.parliament.uk/resources/641879/answer",,,"29","Work and Pensions","Work and Pensions","2016-11-22","Poverty: Children","2","House of Lords","To ask Her Majesty’s Government what assessment they have made of the findings of the Early Intervention Foundation's Report <i>The Cost of Late Intervention: EIF analysis 2016</i>; and what plans they have to prioritise preventative interventions in seeking to dismantle the root causes of poverty.","false","Biography information for Lord Bird","Lord Bird","HL3447"
"http://data.parliament.uk/resources/432079","Department for Work and Pensions","false","2015-12-08","<p>The Government’s response to the consultation on new measures of child poverty can be found in Annex E of the attached document. The analysis of the results in 2013 recorded that two respondents to the consultation said income should not be included in a measure of child poverty.</p><br /><p>We cannot give the names of the respondents due to Data Protection Act requirements. However, one was from an academic organisation and the other was from a frontline service.</p><br /><p>The Government wants to focus future effort on tackling the root causes of child poverty. That is why the life chances provisions in the Welfare Reform and Work Bill will introduce new measures of worklessness and educational attainment, and why we have committed ourselves to introducing a set of non-statutory indicators including ones on family breakdown, problem debt and addiction. These measures will focus action on the areas which the evidence indicates will make a sustainable difference to children’s lives - now and in the future.</p>","Lord Freud",,"2015-12-08T17:55:31.667Z","http://data.parliament.uk/resources/432079/answer","Biography information for Lord Freud","http://data.parliament.uk/resources/432079/answer","Consultation on Child Poverty Strategy.pdf","Consultaion on Child Poverty Strategy","29","Work and Pensions","Work and Pensions","2015-11-24","Poverty: Children","2","House of Lords","To ask Her Majesty’s Government how many of those responding to the 2012 consultation <i>Measuring Child Poverty</i> supported the exclusion of any income measure; and whether they will name those organisations that supported the exclusion.","false","Biography information for Baroness Lister of Burtersett","Baroness Lister of Burtersett","HL3852"
"http://data.parliament.uk/resources/391323","Department for Work and Pensions","false","2015-07-30"," <p /> <p><strong> </strong></p><p>The recent IFS report is positive about the Government’s new approach to tackling the root causes of poverty: they said that “focusing on a broad range of inputs into life chances and causes of poverty is sensible.” They also add that “family worklessness certainly is a sensible thing to track if one wants to reduce the prevalence of low living standards.”</p><p> </p><p>This Government knows that work remains the best route out of poverty. Research shows that around three-quarters of poor children in families that move into full employment exit poverty. We are committed to supporting parents to move into work, increase their earnings, and keep more of what they earn. Universal Credit, our investment in childcare and the introduction of the National Living Wage will all play an important part.</p><p> </p><p>The Government also recognises that improving skills and progression is the key to making work pay. That is why under this Government we intend to create three million more apprenticeships over the next five years, and to help people move on to better jobs by improving qualifications and providing additional support through Jobcentre Plus.</p>","Baroness Altmann",,"2015-07-30T13:27:22.41Z","http://data.parliament.uk/resources/391323/answer","Biography information for Baroness Altmann","http://data.parliament.uk/resources/391323/answer",,,"29","Work and Pensions","Work and Pensions","2015-07-20","Poverty: Children","2","House of Lords","To ask Her Majesty’s Government what assessment they have made of the report by the Institute of Fiscal Studies <i>Living Standards, Poverty and Inequality in the UK: 2015;</i> and how they plan to respond to the findings that nearly 63 per cent of British children living in poverty are in working families.","false","Biography information for Lord Tyler","Lord Tyler","HL1667"
"http://data.parliament.uk/resources/166639","Department for Work and Pensions","false","2014-12-11"," <p /> <p>The Government does not produce forecasts of the number of children living in income poverty as the number of children in poverty is dependent on factors which cannot be reliably predicted, such as the median income.</p><p> </p><p>The Government does measure annual child poverty statistics through the National Statistics Households Below Average Income (HBAI) series. Estimates of the number and proportion of children in relative and absolute low income in the UK have consistently been reported since 1998/99; these are available for each financial year up to 2012/13, the latest period for which estimates are available.</p><p> </p><p>There has been no assessment of the impact on child poverty of the combined tax and benefit changes announced since May 2010. Available survey data does not allow the Government to robustly assess the combined effects of tax and benefit policy on households with children.</p><p> </p><p>However, this Government has taken unprecedented steps to assess the effects of its policy decisions across the distribution of household income, by publishing analysis of the cumulative effects of the tax and welfare measures announced at each fiscal event since the June Budget 2010. The latest analysis can be found in Chapter 2 of the attached report.</p>","Lord Freud","HL3231","2014-12-11T16:55:04.767Z","http://data.parliament.uk/resources/166639/answer","Biography information for Lord Freud","http://data.parliament.uk/resources/166639/answer",,,"29","Work and Pensions","Work and Pensions","2014-11-27","Poverty: Children","2","House of Lords","To ask Her Majesty’s Government whether they have carried out any forecasts of the level of child poverty between now and 2020; and if so, whether they will be made public.","false","Biography information for The Lord Bishop of St Albans","The Lord Bishop of St Albans","HL3230"
"http://data.parliament.uk/resources/166640","Department for Work and Pensions","false","2014-12-11"," <p>The Government does not produce forecasts of the number of children living in income poverty as the number of children in poverty is dependent on factors which cannot be reliably predicted, such as the median income.</p><p> </p><p>The Government does measure annual child poverty statistics through the National Statistics Households Below Average Income (HBAI) series. Estimates of the number and proportion of children in relative and absolute low income in the UK have consistently been reported since 1998/99; these are available for each financial year up to 2012/13, the latest period for which estimates are available.</p><p> </p><p>There has been no assessment of the impact on child poverty of the combined tax and benefit changes announced since May 2010. Available survey data does not allow the Government to robustly assess the combined effects of tax and benefit policy on households with children.</p><p> </p><p>However, this Government has taken unprecedented steps to assess the effects of its policy decisions across the distribution of household income, by publishing analysis of the cumulative effects of the tax and welfare measures announced at each fiscal event since the June Budget 2010. The latest analysis can be found in Chapter 2 of the attached report.</p>","Lord Freud","HL3230","2014-12-11T16:55:04.907Z","http://data.parliament.uk/resources/166640/answer","Biography information for Lord Freud","http://data.parliament.uk/resources/166640/answer",,,"29","Work and Pensions","Work and Pensions","2014-11-27","Poverty: Children","2","House of Lords","To ask Her Majesty’s Government whether they have calculated the impact on child poverty of the combined tax and benefit policy changes announced to date since May 2010.","false","Biography information for The Lord Bishop of St Albans","The Lord Bishop of St Albans","HL3231"
