"uri","answering body","answer > is ministerial correction","answer > date of answer","answer > answer text","answer > answering member constituency","answer > answering member printed","answer > question first answered","answer > uri","answer > answering member > label","answer > uri","answer > previous answer version > answering member constituency","answer > previous answer version > answering member printed","answer > previous answer version > uri","answer > previous answer version > answering member > label","answering dept id","answering dept short name","answering dept sort name","date","hansard heading","house id","legislature > pref label","question text","registered interest","tabling member > label","tabling member constituency","tabling member printed","uin"
"http://data.parliament.uk/resources/1092605","Department for Business, Energy and Industrial Strategy","false","2019-03-26","<p>The International Accounting Standards and European Public Limited-Liability Company (Amendment etc.) (EU Exit) Regulations 2019 transfer the European Commission’s powers to endorse and adopt International Accounting Standards (IAS) to the Secretary of State. It also provides for these powers to be sub-delegated to a UK body. The policy intention is that the sub-delegation to a UK Endorsement Board will be performed by an affirmative SI later this year. Until then, the responsibility to endorse and adopt IAS for use in the UK will lie with my rt. hon. Friend the Secretary of State. He will be supported in this role by the FRC and, once appointed, the Endorsement Board secretariat staff. Recruitment is currently underway.</p>","Rochester and Strood","Kelly Tolhurst","2019-03-26T15:10:08.113Z","http://data.parliament.uk/resources/1092605/answer","Biography information for Kelly Tolhurst","http://data.parliament.uk/resources/1092605/answer",,,,,"201","Business, Energy and Industrial Strategy","Business, Energy and Industrial Strategy","2019-03-21","UK Endorsement Board","1","House of Commons","To ask the Secretary of State for Business, Energy and Industrial Strategy, pursuant to the oral contribution of 20 March 2019 of the Parliamentary Under-Secretary of State for Business, Energy and Industrial Strategy Kelly Tolhurst to the Eighth Delegated Legislation Committee on the Draft International Accounting Standards and European Public Limited-Liability Company (amendment etc.) (EU Exit) Regulations 2019, Official Report, column 8, who will carry out the work that the endorsement board will be responsible for until that body is constituted.","false","Biography information for Bill Esterson","Sefton Central","Bill Esterson","235296"
"http://data.parliament.uk/resources/1092625","Department for Business, Energy and Industrial Strategy","false","2019-03-26","<p>The Government published the UK’s first ever Bioeconomy Strategy in December 2018. Developed with industry, and trailed in the Clean Growth Strategy, it identifies biomanufacturing and biorefineries as a key route to developing less carbon intensive products for the UK, from energy and fuels to bio-based chemicals, plastics and other materials. Building on the UK’s world class expertise in bioscience and biotechnology, these technologies can be applied across multiple sectors to generate transformational change in productivity and clean growth.</p>","Kingswood","Chris Skidmore","2019-03-26T17:39:51.807Z","http://data.parliament.uk/resources/1092625/answer","Biography information for Chris Skidmore","http://data.parliament.uk/resources/1092625/answer",,,,,"201","Business, Energy and Industrial Strategy","Business, Energy and Industrial Strategy","2019-03-21","Life Sciences: Economic Growth","1","House of Commons","To ask the Secretary of State for Business, Energy and Industrial Strategy, what assessment his Department has made of the role of biomanufacturing in supporting the Government's Clean Growth Strategy.","false","Biography information for Paul Farrelly","Newcastle-under-Lyme","Paul Farrelly","235254"
"http://data.parliament.uk/resources/1092183","Department for Business, Energy and Industrial Strategy","false","2019-03-26","<p>The Government recognises the critical role that post offices play in communities and for small businesses across the UK. This is why the Government committed to safeguard the post office network and protect existing rural services. The overall number of post offices across the UK remains at its most stable in decades with over 11,500 branches thanks to significant Government investment of over £2 billion since 2010.</p><p> </p><p>While the Government sets the strategic direction for the Post Office, it allows the company the commercial freedom to deliver this strategy as an independent business. Impact assessments in respect of the franchising of Crown Post Offices to WHSmith are an operational matter for the Post Office. I have therefore asked the Group Chief Executive of Post Office Limited, to write to the hon. Member on this matter. A copy of the reply will be placed in the Libraries of the House.</p>","Rochester and Strood","Kelly Tolhurst","2019-03-26T15:06:19.937Z","http://data.parliament.uk/resources/1092183/answer","Biography information for Kelly Tolhurst","http://data.parliament.uk/resources/1092183/answer","Rochester and Strood","Kelly Tolhurst","http://data.parliament.uk/resources/1092183/answer/previousversion/109939","Biography information for Kelly Tolhurst","201","Business, Energy and Industrial Strategy","Business, Energy and Industrial Strategy","2019-03-20","WH Smith: Post Offices","1","House of Commons","To ask the Secretary of State for Business, Energy and Industrial Strategy, what equality impact assessment has been undertaken on the franchising of 74 crown post offices to WHSmith announced in October 2018.","false","Biography information for Debbie Abrahams","Oldham East and Saddleworth","Debbie Abrahams","234733"
"http://data.parliament.uk/resources/1092187","Department for Business, Energy and Industrial Strategy","false","2019-04-02","<p>The Department does not hold information on the number of consultants hired in any one year as this work is often commissioned as part of an outcomes based contract to ensure value for money.</p><p> </p><p>The amount spent on consultants each year since 2016 is:</p><p> </p><p>2016-17 - £63.0 million of which £41.4 million was related to Site Licence Companies</p><p>2017-18 - £50.4 million of which £37.3 million was related to Site Licence Companies.</p><p> </p><p>Site Licence Companies manage and operate the nuclear facilities at the Nuclear Decommissioning Authority (NDA) sites.</p><p> </p>","Rochester and Strood","Kelly Tolhurst","2019-04-02T12:21:37.04Z","http://data.parliament.uk/resources/1092187/answer","Biography information for Kelly Tolhurst","http://data.parliament.uk/resources/1092187/answer","Watford","Richard Harrington","http://data.parliament.uk/resources/1092187/answer/previousversion/109940","Biography information for Lord Harrington of Watford","201","Business, Energy and Industrial Strategy","Business, Energy and Industrial Strategy","2019-03-20","Department for Business, Energy and Industrial Strategy: Consultants","1","House of Commons","To ask the Secretary of State for Business, Energy and Industrial Strategy, how many consultants his Department has hired since 2016; and what the cost of that hiring was to the public purse.","false","Biography information for Peter Dowd","Bootle","Peter Dowd","234810"
"http://data.parliament.uk/resources/1092209","Department for Business, Energy and Industrial Strategy","false","2019-04-02","<p>The breakdown of expenditure included in Other Programmes under Deliver an ambitious industrial strategy Resource DEL is as shown in the following table: -</p><p> </p><table><tbody><tr><td><p> </p></td><td><p>£m</p></td></tr><tr><td><p>Ordnance Survey - Public Sector Mapping Agreement</p></td><td><p>6.0</p></td></tr><tr><td><p>Office for Product Safety &amp; Standards</p></td><td><p>3.8</p></td></tr><tr><td><p>Design council</p></td><td><p>2.5</p></td></tr><tr><td><p>Portfolio Management</p></td><td><p>2.1</p></td></tr><tr><td><p>Launch Investments</p></td><td><p>0.5</p></td></tr><tr><td><p>International Science and Innovation Policy</p></td><td><p>0.2</p></td></tr><tr><td><p>Homes England: Innovation</p></td><td><p>0.1</p></td></tr><tr><td><p>Centrally held</p></td><td><p>15.1</p></td></tr><tr><td><p>Intellectual Property Office dividend</p></td><td><p>-1.0</p></td></tr><tr><td><p><strong>Total (Other programmes)</strong></p></td><td><p><strong>29.4*</strong></p></td></tr><tr><td><p><em>Table does not add up due to rounding</em></p></td><td><p> </p></td></tr></tbody></table>","Rochester and Strood","Kelly Tolhurst","2019-04-02T12:21:44.77Z","http://data.parliament.uk/resources/1092209/answer","Biography information for Kelly Tolhurst","http://data.parliament.uk/resources/1092209/answer","Watford","Richard Harrington","http://data.parliament.uk/resources/1092209/answer/previousversion/109929","Biography information for Lord Harrington of Watford","201","Business, Energy and Industrial Strategy","Business, Energy and Industrial Strategy","2019-03-20","Department for Business, Energy and Industrial Strategy: Public Expenditure","1","House of Commons","To ask the Secretary of State for Business, Energy and Industrial Strategy, with reference to row four of the table on page 35 of the BEIS 2018-19 Main Estimate Memorandum, if he will publish the other programmes with their respective budgets referred to in that table.","false","Biography information for Rebecca Long Bailey","Salford and Eccles","Rebecca Long Bailey","234820"
"http://data.parliament.uk/resources/1092210","Department for Business, Energy and Industrial Strategy","false","2019-04-02","<p>The breakdown of expenditure included in Business and Enterprise Resource DEL is as shown in the following table: -</p><p> </p><table><tbody><tr><td><p> </p></td><td><p>£m</p></td></tr><tr><td><p>Carbon Price Floor Compensation</p></td><td><p>60.0</p></td></tr><tr><td><p>EU ETS compensation</p></td><td><p>28.0</p></td></tr><tr><td><p>Productivity Council</p></td><td><p>5.0</p></td></tr><tr><td><p>Defence Solution Centre</p></td><td><p>3.0</p></td></tr><tr><td><p>Sponsorship</p></td><td><p>1.7</p></td></tr><tr><td><p>Cornwall Grant</p></td><td><p>1.2</p></td></tr><tr><td><p>Economic Intelligence And Analysis</p></td><td><p>1.1</p></td></tr><tr><td><p>Building Information Management</p></td><td><p>1.0</p></td></tr><tr><td><p>Advanced Manufacturing: Research</p></td><td><p>0.4</p></td></tr><tr><td><p>Regional Support Programme</p></td><td><p>0.3</p></td></tr><tr><td><p>Office for Life Sciences: Database and Web Portal</p></td><td><p>0.1</p></td></tr><tr><td><p><strong>Total (Business and Enterprise)</strong></p></td><td><p><strong>101.6*</strong></p></td></tr><tr><td><p><em>*Table does not add up due to rounding</em></p></td><td><p> </p></td></tr></tbody></table>","Rochester and Strood","Kelly Tolhurst","2019-04-02T12:21:52.277Z","http://data.parliament.uk/resources/1092210/answer","Biography information for Kelly Tolhurst","http://data.parliament.uk/resources/1092210/answer","Watford","Richard Harrington","http://data.parliament.uk/resources/1092210/answer/previousversion/109931","Biography information for Lord Harrington of Watford","201","Business, Energy and Industrial Strategy","Business, Energy and Industrial Strategy","2019-03-20","Department for Business, Energy and Industrial Strategy: Public Expenditure","1","House of Commons","To ask the Secretary of State for Business, Energy and Industrial Strategy, with reference to row three of the table on page 35 of the BEIS 2018-19 Main Estimate Memorandum, if he will publish a detailed breakdown under the heading Business and Enterprise.","false","Biography information for Rebecca Long Bailey","Salford and Eccles","Rebecca Long Bailey","234821"
"http://data.parliament.uk/resources/1092211","Department for Business, Energy and Industrial Strategy","false","2019-04-02","<p>The Department has responsibility for liabilities arising from the former publicly-owned company British Shipbuilders. The liabilities largely relate to damages due to former workers who were exposed to asbestos over a period until the late 1980s.</p>","Rochester and Strood","Kelly Tolhurst","2019-04-02T12:21:58.477Z","http://data.parliament.uk/resources/1092211/answer","Biography information for Kelly Tolhurst","http://data.parliament.uk/resources/1092211/answer","Watford","Richard Harrington","http://data.parliament.uk/resources/1092211/answer/previousversion/109934","Biography information for Lord Harrington of Watford","201","Business, Energy and Industrial Strategy","Business, Energy and Industrial Strategy","2019-03-20","Department for Business, Energy and Industrial Strategy: British Shipbuilders","1","House of Commons","To ask the Secretary of State for Business, Energy and Industrial Strategy, with reference to row five of the table on page 35 of the BEIS 2018-19 Main Estimate Memorandum, what the spending under British Shipbuilders relates to.","false","Biography information for Rebecca Long Bailey","Salford and Eccles","Rebecca Long Bailey","234822"
"http://data.parliament.uk/resources/1092212","Department for Business, Energy and Industrial Strategy","false","2019-03-25","<p>The breakdown of expenditure included under Better Regulation Resource DEL is as shown in the following table: -</p><p> </p><table><tbody><tr><td><p> </p></td><td><p>£m</p></td></tr><tr><td><p>Office for Product Safety and Standards</p></td><td><p>5.0</p></td></tr><tr><td><p>Better Regulation Executive</p></td><td><p>3.4</p></td></tr><tr><td><p><strong>Total (Better Regulation)</strong></p></td><td><p><strong>8.4</strong></p></td></tr></tbody></table><p> </p>","Watford","Richard Harrington","2019-03-25T17:07:33.07Z","http://data.parliament.uk/resources/1092212/answer","Biography information for Lord Harrington of Watford","http://data.parliament.uk/resources/1092212/answer",,,,,"201","Business, Energy and Industrial Strategy","Business, Energy and Industrial Strategy","2019-03-20","Department for Business, Energy and Industrial Strategy: Public Expenditure","1","House of Commons","To ask the Secretary of State for Business, Energy and Industrial Strategy, with reference to row 10 of the table on page 35 of the BEIS 2018-19 Main Estimate Memorandum, if he will publish a description of spending under the heading Better Regulation.","false","Biography information for Rebecca Long Bailey","Salford and Eccles","Rebecca Long Bailey","234823"
"http://data.parliament.uk/resources/1092213","Department for Business, Energy and Industrial Strategy","false","2019-04-02","<p>The breakdown of expenditure included under Market Frameworks Resource DEL is as shown in the following table: -</p><p> </p><table><tbody><tr><td><p> </p></td><td><p>£m</p></td></tr><tr><td><p>Citizens Advice</p></td><td><p>35.3</p></td></tr><tr><td><p>Chartered Trading Standards Institute</p></td><td><p>13.4</p></td></tr><tr><td><p>National Minimum Wage (NMW) Enforcement</p></td><td><p>12.2</p></td></tr><tr><td><p>NMW &amp; NLW (National Living Wage) enforcement and awareness raising campaigns</p></td><td><p>9.8</p></td></tr><tr><td><p>NMW Enforcement complex cases</p></td><td><p>4.3</p></td></tr><tr><td><p>New Labour Market Enforcement Agency</p></td><td><p>1.4</p></td></tr><tr><td><p>Small Business Commissioner</p></td><td><p>1.4</p></td></tr><tr><td><p>Convention of Scottish Local Authorities</p></td><td><p>1.2</p></td></tr><tr><td><p>Office for Product Safety and Standards: Product Regulations</p></td><td><p>1.1</p></td></tr><tr><td><p>EU Expertise: General Costs</p></td><td><p>0.9</p></td></tr><tr><td><p>Labour Market Emerging Priorities</p></td><td><p>0.6</p></td></tr><tr><td><p>Departmental Programme Translation Work</p></td><td><p>0.5</p></td></tr><tr><td><p>Paternity Adoption and Shared Parental Pay</p></td><td><p>0.5</p></td></tr><tr><td><p>European Consumer Centre</p></td><td><p>0.4</p></td></tr><tr><td><p>National Minimum Wage</p></td><td><p>0.4</p></td></tr><tr><td><p>ADR (alternative dispute resolution) Directive</p></td><td><p>0.3</p></td></tr><tr><td><p>Shared Parental Leave Comms</p></td><td><p>0.3</p></td></tr><tr><td><p>College For Europe</p></td><td><p>0.2</p></td></tr><tr><td><p>Consumer Advocacy for Energy, Post and cross-sector</p></td><td><p>0.2</p></td></tr><tr><td><p>eIDAS Implementation</p></td><td><p>0.1</p></td></tr><tr><td><p><strong>Total (Market Frameworks)</strong></p></td><td><p><strong>84.3*</strong></p></td></tr><tr><td><p><em>*Table does not add up due to rounding</em></p></td><td><p> </p></td></tr></tbody></table>","Rochester and Strood","Kelly Tolhurst","2019-04-02T12:22:06.967Z","http://data.parliament.uk/resources/1092213/answer","Biography information for Kelly Tolhurst","http://data.parliament.uk/resources/1092213/answer","Watford","Richard Harrington","http://data.parliament.uk/resources/1092213/answer/previousversion/109937","Biography information for Lord Harrington of Watford","201","Business, Energy and Industrial Strategy","Business, Energy and Industrial Strategy","2019-03-20","Department for Business, Energy and Industrial Strategy: Public Expenditure","1","House of Commons","To ask the Secretary of State for Business, Energy and Industrial Strategy, with reference to row 11 of the table on page 35 of the BEIS 2018-19 Main Estimate Memorandum, if he will publish a breakdown of spending under the heading Market Frameworks.","false","Biography information for Rebecca Long Bailey","Salford and Eccles","Rebecca Long Bailey","234824"
"http://data.parliament.uk/resources/1092214","Department for Business, Energy and Industrial Strategy","false","2019-03-25","<p>The programmes included under Capability Resource DEL are as follows: -</p><ul><li>Assurance Reviews and PPM Capability</li><li>Centrally held/unallocated Programme budget including Invest to Save</li><li>Communications</li><li>Compensations Payments Programme</li><li>Construction: Statistics and Other Sponsorship Activities</li><li>Core BEIS Administration costs</li><li>Departmental Security</li><li>Staff Exit Provision</li><li>Estates</li><li>Energy Resilience</li><li>Energy Statistics Research &amp; Analysis</li><li>Finance</li><li>Income from Other Government Departments and Devolved Administrations for the Committee on Climate Change</li><li>Legal</li></ul>","Watford","Richard Harrington","2019-03-25T17:07:45.887Z","http://data.parliament.uk/resources/1092214/answer","Biography information for Lord Harrington of Watford","http://data.parliament.uk/resources/1092214/answer",,,,,"201","Business, Energy and Industrial Strategy","Business, Energy and Industrial Strategy","2019-03-20","Department for Business, Energy and Industrial Strategy: Public Expenditure","1","House of Commons","To ask the Secretary of State for Business, Energy and Industrial Strategy, with reference to row 24 of the table on page 36 of the BEIS 2018-19 Main Estimate Memorandum, if he will publish a list of all programmes funded under the heading Capability including those under Other Programmes.","false","Biography information for Rebecca Long Bailey","Salford and Eccles","Rebecca Long Bailey","234825"
