"uri","answering body","answer > is ministerial correction","answer > date of answer","answer > answer text","answer > answering member constituency","answer > answering member printed","answer > grouped question UIN","answer > question first answered","answer > uri","answer > answering member > label","answer > uri","answer > attachment > file name","answer > attachment > title","answering dept id","answering dept short name","answering dept sort name","date","hansard heading","house id","legislature > pref label","question text","registered interest","tabling member > label","tabling member constituency","tabling member printed","uin"
"http://data.parliament.uk/resources/1138850","Ministry of Justice","false","2019-07-31","<p>Everyone leaving custody should have a safe and suitable home to go to on release; having somewhere to live gives people a stable platform from which to access health services, hold down a job and reduces the likelihood of them reoffending.</p><p>Ministry of Justice officials are working closely with officials from the Ministry of Housing, Communities and Local Government to monitor the referrals being made and to facilitate joint working between local authorities and prison and probation providers.</p><p>Overcoming the many barriers offenders face to securing suitable accommodation is something that Ministry of Justice cannot do in isolation. While statutory responsibility for housing (including planning) and homelessness lies with local authorities in England, and with the Welsh Assembly in Wales, we are committed to working with other departments to tackle homelessness and rough sleeping.</p>","South East Cambridgeshire","Lucy Frazer",,"2019-07-31T14:46:29.653Z","http://data.parliament.uk/resources/1138850/answer","Biography information for Lucy Frazer","http://data.parliament.uk/resources/1138850/answer",,,"54","Justice","Justice","2019-07-15","Offenders: Homelessness","1","House of Commons","To ask the Secretary of State for Justice, what assessment he has made of the effect of the Homelessness Reduction Act 2017 on the (a) effectiveness of joint-working between criminal justice agencies and local authorities and (b) homelessness.","false","Biography information for Bambos Charalambous","Enfield, Southgate","Bambos Charalambous","277248"
"http://data.parliament.uk/resources/1138851","Ministry of Justice","false","2019-07-17","<p>This information could only be obtained at disproportionate cost, as there would be a need to check individual records of young people released from custody in 2018/19.</p><p> </p><p>The first step to reducing reoffending is making sure everyone leaving prison has access to secure and stable accommodation, and we work closely with local authorities to support offenders with their resettlement on release.</p>","Charnwood","Edward Argar",,"2019-07-17T17:30:07.31Z","http://data.parliament.uk/resources/1138851/answer","Biography information for Edward Argar","http://data.parliament.uk/resources/1138851/answer",,,"54","Justice","Justice","2019-07-15","Prisoners' Release: Children","1","House of Commons","To ask the Secretary of State for Justice, how many children under the age of 18 have been released from custody without accommodation in the last 12 months.","false","Biography information for Bambos Charalambous","Enfield, Southgate","Bambos Charalambous","277249"
"http://data.parliament.uk/resources/1138852","Ministry of Justice","false","2019-07-23","<p>Everyone leaving custody should have a safe and suitable home to go to on release; having somewhere to live gives people a stable platform from which to access health services, hold down a job and reduces the likelihood of them reoffending. While statutory responsibility for housing (including planning) and homelessness lies with local authorities in England, and with the Welsh Assembly in Wales, we are committed to working with other departments to tackle homelessness and rough sleeping.</p><p> </p><p>There has been a gradual flow of referrals from prisons and probation providers since the commencement of the ‘Duty to Refer’ on 1 October 2018. Between 1 October and 30 June: 926 referrals made by probation staff were recorded on the probation operational database, NDELIUS; 613 referrals made by prison staff were recorded on the prison operational database, P-NOMIS.</p><p> </p><p>Over the coming months we will be re-promoting the duty ten months on from commencement, while reviewing the guidance issued to reflect lessons learnt.</p>","South Swindon","Robert Buckland",,"2019-07-23T16:26:35.103Z","http://data.parliament.uk/resources/1138852/answer","Biography information for Sir Robert Buckland","http://data.parliament.uk/resources/1138852/answer",,,"54","Justice","Justice","2019-07-15","Offenders: Homelessness","1","House of Commons","To ask the Secretary of State for Justice, how many referrals have been made by (a) prison and (b) probation services to local authorities under the Homelessness Reduction Act 2017 duty to refer since October 2018.","false","Biography information for Bambos Charalambous","Enfield, Southgate","Bambos Charalambous","277250"
"http://data.parliament.uk/resources/1138853","Ministry of Justice","false","2019-07-31","<p>All deaths of offenders under supervision are the subject of an internal review by the relevant probation provider, which must consider from the circumstances whether any areas of probation practice could be improved. This includes the deaths of those being supervised after release from custody. Probation providers report annually to Her Majesty's Prison and Probation Service on the numbers of deaths and their causes, and share learning points from the reviews that they have conducted. A small number of deaths under post-release supervision, including those that occur in Approved Premises, are independently investigated by the Prisons and Probation Ombudsman.</p><p> </p><p>The number of offenders who died under supervision increased from 704 in 2010/11 to 955 in 2017/18. The Offender Rehabilitation Act (ORA) was introduced on 1 February 2015 and resulted in an increase in the number of offenders on post-release supervision. While the total number of deaths under supervision has continued to increase, the number of deaths post-release fell by 8% in the last year, from 401 in 2016/17 to 367 in 2017/18.</p><p> </p><p>The National Suicide Prevention Strategy identifies people in contact with the criminal justice system as a high-risk group, and we recognise that the time following release from prison can be a particularly high-risk period for suicide and for deaths from other causes. The primary role of probation is to protect the public and prevent re-offending, and people under supervision in the community are not in the care of HM Prison and Probation Service in the way that they are when in custody. While probation staff do everything they can to help offenders find access to vital services including healthcare, housing, and treatment for drug and alcohol problems, they do not have sole responsibility for caring for them. We are conducting a review of post-release deaths, which aims to identify what further actions may be appropriate to prevent them, while recognising that a range of other organisations share responsibility for their wellbeing.</p><p> </p><p>We are also investing an extra £22m in ‘through-the-gate’ assistance for offenders, to help them find the support they need on issues such as housing, healthcare and employment, and they have the same access to these services as any other person in the community.</p><p> </p><p>The number of deaths under post-release supervision during 2017/18, broken down by time elapsed since release and by cause of death, is in the attached table. The figures are taken from probation providers’ annual reports. Care is taken when processing and analysing them, but the detail is subject to the inaccuracies inherent in any large-scale recording system.</p>","South East Cambridgeshire","Lucy Frazer","277252 ; 277253","2019-07-31T15:14:41.79Z","http://data.parliament.uk/resources/1138853/answer","Biography information for Lucy Frazer","http://data.parliament.uk/resources/1138853/answer","PQ 277251-53 Bambos Charalambous MP figures.xlsx","Table","54","Justice","Justice","2019-07-15","Probation: Death","1","House of Commons","To ask the Secretary of State for Justice, what steps his Department takes to (a) monitor, (b) investigate, (c) learn lessons for prevention from and (d) respond at a (i) local and (ii) national level to deaths of offenders in the community on post custody supervision.","false","Biography information for Bambos Charalambous","Enfield, Southgate","Bambos Charalambous","277251"
"http://data.parliament.uk/resources/1138854","Ministry of Justice","false","2019-07-31","<p>All deaths of offenders under supervision are the subject of an internal review by the relevant probation provider, which must consider from the circumstances whether any areas of probation practice could be improved. This includes the deaths of those being supervised after release from custody. Probation providers report annually to Her Majesty's Prison and Probation Service on the numbers of deaths and their causes, and share learning points from the reviews that they have conducted. A small number of deaths under post-release supervision, including those that occur in Approved Premises, are independently investigated by the Prisons and Probation Ombudsman.</p><p> </p><p>The number of offenders who died under supervision increased from 704 in 2010/11 to 955 in 2017/18. The Offender Rehabilitation Act (ORA) was introduced on 1 February 2015 and resulted in an increase in the number of offenders on post-release supervision. While the total number of deaths under supervision has continued to increase, the number of deaths post-release fell by 8% in the last year, from 401 in 2016/17 to 367 in 2017/18.</p><p> </p><p>The National Suicide Prevention Strategy identifies people in contact with the criminal justice system as a high-risk group, and we recognise that the time following release from prison can be a particularly high-risk period for suicide and for deaths from other causes. The primary role of probation is to protect the public and prevent re-offending, and people under supervision in the community are not in the care of HM Prison and Probation Service in the way that they are when in custody. While probation staff do everything they can to help offenders find access to vital services including healthcare, housing, and treatment for drug and alcohol problems, they do not have sole responsibility for caring for them. We are conducting a review of post-release deaths, which aims to identify what further actions may be appropriate to prevent them, while recognising that a range of other organisations share responsibility for their wellbeing.</p><p> </p><p>We are also investing an extra £22m in ‘through-the-gate’ assistance for offenders, to help them find the support they need on issues such as housing, healthcare and employment, and they have the same access to these services as any other person in the community.</p><p> </p><p>The number of deaths under post-release supervision during 2017/18, broken down by time elapsed since release and by cause of death, is in the attached table. The figures are taken from probation providers’ annual reports. Care is taken when processing and analysing them, but the detail is subject to the inaccuracies inherent in any large-scale recording system.</p>","South East Cambridgeshire","Lucy Frazer","277251 ; 277253","2019-07-31T15:14:41.823Z","http://data.parliament.uk/resources/1138854/answer","Biography information for Lucy Frazer","http://data.parliament.uk/resources/1138854/answer","PQ 277251-53 Bambos Charalambous MP figures.xlsx","Table","54","Justice","Justice","2019-07-15","Probation: Death","1","House of Commons","To ask the Secretary of State for Justice, what assessment he has made of the implications for his policies of the rise in deaths of people on post-custody supervision since 2010.","false","Biography information for Bambos Charalambous","Enfield, Southgate","Bambos Charalambous","277252"
"http://data.parliament.uk/resources/1138855","Ministry of Justice","false","2019-07-31","<p>All deaths of offenders under supervision are the subject of an internal review by the relevant probation provider, which must consider from the circumstances whether any areas of probation practice could be improved. This includes the deaths of those being supervised after release from custody. Probation providers report annually to Her Majesty's Prison and Probation Service on the numbers of deaths and their causes, and share learning points from the reviews that they have conducted. A small number of deaths under post-release supervision, including those that occur in Approved Premises, are independently investigated by the Prisons and Probation Ombudsman.</p><p> </p><p>The number of offenders who died under supervision increased from 704 in 2010/11 to 955 in 2017/18. The Offender Rehabilitation Act (ORA) was introduced on 1 February 2015 and resulted in an increase in the number of offenders on post-release supervision. While the total number of deaths under supervision has continued to increase, the number of deaths post-release fell by 8% in the last year, from 401 in 2016/17 to 367 in 2017/18.</p><p> </p><p>The National Suicide Prevention Strategy identifies people in contact with the criminal justice system as a high-risk group, and we recognise that the time following release from prison can be a particularly high-risk period for suicide and for deaths from other causes. The primary role of probation is to protect the public and prevent re-offending, and people under supervision in the community are not in the care of HM Prison and Probation Service in the way that they are when in custody. While probation staff do everything they can to help offenders find access to vital services including healthcare, housing, and treatment for drug and alcohol problems, they do not have sole responsibility for caring for them. We are conducting a review of post-release deaths, which aims to identify what further actions may be appropriate to prevent them, while recognising that a range of other organisations share responsibility for their wellbeing.</p><p> </p><p>We are also investing an extra £22m in ‘through-the-gate’ assistance for offenders, to help them find the support they need on issues such as housing, healthcare and employment, and they have the same access to these services as any other person in the community.</p><p> </p><p>The number of deaths under post-release supervision during 2017/18, broken down by time elapsed since release and by cause of death, is in the attached table. The figures are taken from probation providers’ annual reports. Care is taken when processing and analysing them, but the detail is subject to the inaccuracies inherent in any large-scale recording system.</p>","South East Cambridgeshire","Lucy Frazer","277251 ; 277252","2019-07-31T15:14:41.853Z","http://data.parliament.uk/resources/1138855/answer","Biography information for Lucy Frazer","http://data.parliament.uk/resources/1138855/answer","PQ 277251-53 Bambos Charalambous MP figures.xlsx","Table","54","Justice","Justice","2019-07-15","Probation: Death","1","House of Commons","To ask the Secretary of State for Justice, how many people died whilst under post-release supervision in 2017-18; and what the (a) number of days between release from prison and date of death and (b) cause of death was in each of those cases.","false","Biography information for Bambos Charalambous","Enfield, Southgate","Bambos Charalambous","277253"
"http://data.parliament.uk/resources/1138972","Ministry of Justice","false","2019-07-23","<p>The table below provides a list of the organisations who provided HM Courts and Tribunals Service with valuations for courts listed in the answer to Question 273431.</p><p> </p><table><tbody><tr><td><p><strong>Court </strong></p></td><td><p><strong>Valuation provider</strong></p></td></tr><tr><td><p>Abergavenny Magistrates’ Court</p></td><td><p>Valuation Office Agency</p></td></tr><tr><td><p>Bow County Court</p></td><td><p>Valuation Office Agency</p></td></tr><tr><td><p>Brecon Law Court</p></td><td><p>GVA</p></td></tr><tr><td><p>Bridgend Magistrates’ Court</p></td><td><p>Valuation Office Agency</p></td></tr><tr><td><p>Caerphilly Magistrates’ Court</p></td><td><p>Valuation Office Agency</p></td></tr><tr><td><p>Carmarthen Law Courts (The Guildhall)</p></td><td><p>Valuation Office Agency</p></td></tr><tr><td><p>Dolgellau Mags &amp; Crown Court</p></td><td><p>Valuation Office Agency</p></td></tr><tr><td><p>Feltham Magistrates’ Court</p></td><td><p>Valuation Office Agency</p></td></tr><tr><td><p>Grantham Magistrates’ Court</p></td><td><p>Valuation Office Agency</p></td></tr><tr><td><p>Greenwich Magistrates’ Court</p></td><td><p>Valuation Office Agency</p></td></tr><tr><td><p>Hammersmith Magistrates’ Court</p></td><td><p>Valuation Office Agency</p></td></tr><tr><td><p>Holyhead Magistrates’ Court (North Anglesey)</p></td><td><p>Valuation Office Agency</p></td></tr><tr><td><p>Liverpool, Dale Street Magistrates’ Court</p></td><td><p>GVA</p></td></tr><tr><td><p>Llangefni County Court</p></td><td><p>Valuation Office Agency</p></td></tr><tr><td><p>Neath And Port Talbot County Court</p></td><td><p>Valuation Office Agency</p></td></tr><tr><td><p>Northallerton Magistrates' Court</p></td><td><p>Valuation Office Agency</p></td></tr><tr><td><p>Pontypridd Magistrates’ Court</p></td><td><p>GVA</p></td></tr><tr><td><p>Rhyl County Court</p></td><td><p>Valuation Office Agency</p></td></tr><tr><td><p>Richmond Upon Thames Magistrates’ Court</p></td><td><p>Valuation Office Agency</p></td></tr><tr><td><p>Solihull Magistrates’ Court</p></td><td><p>GVA</p></td></tr><tr><td><p>Tottenham (Enfield) Magistrates’ Court</p></td><td><p>Valuation Office Agency</p></td></tr><tr><td><p>Waltham Forest Magistrates’ Court</p></td><td><p>Valuation Office Agency</p></td></tr><tr><td><p>Watford Magistrates’ Court</p></td><td><p>JLL</p></td></tr><tr><td><p>Woolwich County Court</p></td><td><p>Valuation Office Agency</p></td></tr></tbody></table><p> </p><p>The closure of any court is not taken lightly – it only happens following full public consultation and when communities have reasonable access to alternative courts.</p>","Blackpool North and Cleveleys","Paul Maynard",,"2019-07-23T11:28:01.82Z","http://data.parliament.uk/resources/1138972/answer","Biography information for Paul Maynard","http://data.parliament.uk/resources/1138972/answer",,,"54","Justice","Justice","2019-07-15","Courts: Sales","1","House of Commons","To ask the Secretary of State for Justice, pursuant to the of Answer 9 July 2019 to Question 273431 on Courts: Sales, which organisation was responsible for providing each of the valuations.","false","Biography information for Richard Burgon","Leeds East","Richard Burgon","277221"
"http://data.parliament.uk/resources/1138973","Ministry of Justice","false","2019-07-22","<p>The requested information cannot be obtained without incurring disproportionate cost.</p><p> </p><p>Her Majesty’s Prison &amp; Probation Service is committed to ensuring that young people in custody are given the opportunity to take part in sport. In October last year, together with a number of leading football organisations, it launched the Twinning Project, in which 40 English Football League and Premier League clubs are working together with prison establishments to help reduce re-offending. The form this work will take will vary depending on the needs of the establishment and the club, but will range from professional coaching qualifications to refereeing and employability skills. There are also plans to extend this approach to include other sports, such as Rugby League.</p><p> </p><p> </p>","Charnwood","Edward Argar",,"2019-07-22T15:53:53.263Z","http://data.parliament.uk/resources/1138973/answer","Biography information for Edward Argar","http://data.parliament.uk/resources/1138973/answer",,,"54","Justice","Justice","2019-07-15","Youth Custody: Sports","1","House of Commons","To ask the Secretary of State for Justice, what the average number of hours per week was that a (a) child and (b) young adult aged 19 to 21 in custody spent playing sport in each year since 2010.","false","Biography information for Richard Burgon","Leeds East","Richard Burgon","277222"
"http://data.parliament.uk/resources/1138974","Ministry of Justice","false","2019-07-23","<p>The number of prosecutions and convictions following a request made under the European Arrest Warrant is not centrally held in the court proceedings database. Identifying these cases would require a manual search of court records, which would be of disproportionate cost.</p>","South Swindon","Robert Buckland",,"2019-07-23T11:44:07.997Z","http://data.parliament.uk/resources/1138974/answer","Biography information for Sir Robert Buckland","http://data.parliament.uk/resources/1138974/answer",,,"54","Justice","Justice","2019-07-15","European Arrest Warrants","1","House of Commons","To ask the Secretary of State for Justice, how many successful prosecutions following a request made under the European Arrest Warrant there have been in each year for which information is available.","false","Biography information for Richard Burgon","Leeds East","Richard Burgon","277223"
"http://data.parliament.uk/resources/1138976","Ministry of Justice","false","2019-07-23","<p>The requested information is provided in the table below.</p><table><tbody><tr><td><strong>Year ending</strong></td><td><strong>Average Number of Justice Beds Available</strong></td></tr><tr><td>March 2018</td><td>117</td></tr><tr><td>March 2017</td><td>118</td></tr><tr><td>March 2016</td><td>133</td></tr><tr><td>March 2015</td><td>139</td></tr><tr><td>March 2014</td><td>162</td></tr><tr><td>March 2013</td><td>166</td></tr><tr><td>March 2012</td><td>183</td></tr><tr><td>March 2011</td><td>192</td></tr><tr><td>March 2010</td><td>198</td></tr></tbody></table><p> </p><p> </p>","Charnwood","Edward Argar",,"2019-07-23T16:56:57.897Z","http://data.parliament.uk/resources/1138976/answer","Biography information for Edward Argar","http://data.parliament.uk/resources/1138976/answer",,,"54","Justice","Justice","2019-07-15","Secure Accommodation","1","House of Commons","To ask the Secretary of State for Justice, what the average number of places available in Secure Children's Home was in each year since 2010.","false","Biography information for Richard Burgon","Leeds East","Richard Burgon","277225"
